{"text_format":"1","workbook":"xlsx","n_sheets":32,"sheets":["Cover Page ","BCE Inc. IS Summary p2","EPMFormattingSheet","BCE Inc. IS HIST p3","BCE Inc. Seg Info Summary p4","BCE Inc. Seg Info HIST p5","Bell Wireless Summary p6","Bell Wireless HIST p7","Bell Wireline Summary  p8","Bell Wireline HIST p9","Net Debt & Bell other info p10","BCE Inc. BS p11","BCE Inc. CF Summary p12","BCE Inc. CF HIST p13","Accomp Notes p14","Accomp Notes p15","Accomp Notes p16","Accomp Notes p17","Accomp Notes p18","Accomp Notes p19","Accomp Notes p20","Accomp Notes p21","Cover Page - Appendix A","Segmented Reporting Changes p23","BCE Inc. Seg Info HIST p24","Non-GAAP p25","Non-GAAP p26","Non-GAAP p27","Non-GAAP p28","Non-GAAP p29","Non-GAAP p30","Non-GAAP p31"],"not_rendered":{"charts":0,"images":20,"macros":1,"external_links":0,"defined_names":240,"comments":0,"pivot_tables":0},"unopened":[],"bounds":{"document_bytes":16777216,"sheet_cells":100000,"rows_first":2000,"rows_last":500,"rows_between":2000,"halvings":0,"cell_chars":16384,"cell_head_chars":4096},"cells_cut":0,"cells_raw":0,"read":"whole","date_system":"1900"}

{"sheet":"Cover Page ","index":0,"n_rows":39,"n_cols":11,"rows_kept":39,"cut":false,"hidden":false,"merged":[]}
[]
[]
[]
[]
[]
[]
[]
[]
[]
[]
[]
[]
[]
[]
[]
[]
[]
[]
[]
[null,null,"T4"]
[]
[]
[]
[]
[]
[]
[null,null,"Relations avec les investisseurs, BCE"]
[null,null,"Thane Fotopoulos"]
[null,null,"514-870-4619"]
[null,null,"thane.fotopoulos@bell.ca"]
[]
[]
[]
[]
[null," ",null,null," ",null," "]
[]
[]
[]
[null,null,null,null,null,null,null,null,null,null," "]

{"sheet":"BCE Inc. IS Summary p2","index":1,"n_rows":55,"n_cols":12,"rows_kept":55,"cut":false,"hidden":false,"merged":[[52,0,52,11],[54,0,54,11]]}
[null,null,null,null,null,null,null,null,null,null,null,"BCE (1)"]
[null,null,null,null,null,null,null,null,null,null,null,"Données opérationnelles consolidées"]
[]
[]
[null,"T4","T4",null,"Variation","% de",null,"TOTAL","TOTAL",null,"Variation","% de"]
["(en millions de dollars canadiens, sauf les montants liés aux actions) (non audité)","2022","2021",null,"($)","variation",null,"2022","2021",null,"($)","variation"]
["Produits d’exploitation"]
["Tirés des services ",5353,5243,null,110,2.0980354758725919E-2,null,20956,20350,null,606,2.9778869778869777E-2]
["Tirés des produits",1086,966,null,120,0.12422360248447205,null,3218,3099,null,119,3.8399483704420784E-2]
["Total des produits d’exploitation",6439,6209,null,230,3.70430020937349E-2,null,24174,23449,null,725,3.0918162821442278E-2]
["Coûts d’exploitation",-4002,-3779,null,-223,-5.9010320190526593E-2,null,-13975,-13556,null,-419,-3.0908822661552079E-2]
["BAIIA ajusté (A)",2437,2430,null,7,2.8806584362139919E-3,null,10199,9893,null,306,3.0930961285757605E-2]
["Marge du BAIIA ajusté (B) (4)",0.37847491846560027,0.39136736994685134,null,null,-1.3000000000000012,null,0.42189956151236868,0.4218943238517634,null,null,0]
["Coûts liés aux indemnités de départ, aux acquisitions et autres",-19,-63,null,44,0.69841269841269837,null,-94,-209,null,115,0.55023923444976075]
["Amortissement des immobilisations corporelles",-922,-925,null,3,3.2432432432432431E-3,null,-3660,-3627,null,-33,-9.0984284532671638E-3]
["Amortissement des immobilisations incorporelles",-270,-251,null,-19,-7.5697211155378488E-2,null,-1063,-982,null,-81,-8.2484725050916502E-2]
["Charges financières"]
["Charges d’intérêts",-319,-275,null,-44,-0.16,null,-1146,-1082,null,-64,-5.9149722735674676E-2]
["Rendements (intérêts) nets au titre des régimes d’avantages postérieurs à l’emploi",13,-5,null,18,"n.s.",null,51,-20,null,71,"n.s."]
["Perte de valeur d’actifs",-150,-30,null,-120,"n.s.",null,-279,-197,null,-82,-0.41624365482233505]
["Autres produits (charges)",19,26,null,-7,-0.26923076923076922,null,-115,160,null,-275,"n.s."]
["Impôt sur le résultat",-222,-249,null,27,0.10843373493975904,null,-967,-1044,null,77,7.3754789272030649E-2]
["Bénéfice net",567,658,null,-91,-0.13829787234042554,null,2926,2892,null,34,1.1756569847856155E-2]
[]
["Bénéfice net attribuable aux :"]
["Actionnaires ordinaires",528,625,null,-97,-0.1552,null,2716,2709,null,7,2.5839793281653748E-3]
["Actionnaires privilégiés",44,33,null,11,0.33333333333333331,null,152,131,null,21,0.16030534351145037]
["Détenteurs de participations ne donnant pas le contrôle ",-5,0,null,-5,"n.s.",null,58,52,null,6,0.11538461538461539]
["Bénéfice net",567,658,null,-91,-0.13829787234042554,null,2926,2892,null,34,1.1756569847856155E-2]
[]
["Bénéfice net par action ordinaire – de base et dilué",0.57873813150774245,0.68758557573517731,null,-0.10999999999999999,-0.15898008667122818,null,2.9797037849698298,2.9890764647467729,0,-1.0000000000000231E-2,-3.34551495016619E-3]
[]
["Dividendes par action ordinaire",0.92,0.875,null,4.500000000000004E-2,5.1428571428571476E-2,null,3.68,3.5,null,0.18000000000000016,5.1428571428571476E-2]
["Nombre moyen pondéré d’actions ordinaires en circulation – de base (en millions)",912,908.8,null,null,null,null,911.5,906.3]
["Nombre moyen pondéré d’actions ordinaires en circulation – dilué (en millions)",912.2,909.6,null,null,null,null,912,906.7]
["Nombre d’actions ordinaires en circulation (en millions)",912,909,null,null,null,null,912,909]
[]
["Bénéfice net ajusté et BPA ajusté"]
["Bénéfice net attribuable aux actionnaires ordinaires",528,625,null,-97,-0.1552,null,2716,2709,null,7,2.5839793281653748E-3]
["Éléments de rapprochement :"]
["Coûts liés aux indemnités de départ, aux acquisitions et autres",19,63,null,-44,-0.69841269841269837,null,94,209,null,-115,-0.55023923444976075]
["(Profits) pertes nets liés à la valeur de marché sur dérivés utilisés à titre de couverture      \n   économique des régimes de rémunération fondée sur des actions qui sont réglés en\n   instruments de capitaux propres",-27,-57,null,30,0.52631578947368418,null,53,-278,null,331,"n.s."]
["Pertes nettes sur participations mises en équivalence dans des entreprises associées\n   et des coentreprises",0,35,null,-35,-1,null,42,49,null,-7,-0.14285714285714285]
["Pertes (profits) nets sur placements",29,6,null,23,"n.s.",null,-24,6,null,-30,"n.s."]
["Coûts liés au remboursement anticipé de la dette",0,0,null,0,0,null,18,53,null,-35,-0.660377358490566]
["Perte de valeur d’actifs",150,30,null,120,"n.s.",null,279,197,null,82,0.41624365482233505]
["Impôt lié aux éléments de rapprochement ci-dessus",-37,-9,null,-28,"n.s.",null,-117,-48,null,-69,"n.s."]
["Participations ne donnant pas le contrôle liées aux éléments de rapprochement ci-dessus",-8,-1,null,-7,"n.s.",null,-4,-2,null,-2,-1]
["Bénéfice net ajusté (A)",654,692,null,-38,-5.4913294797687862E-2,null,3057,2895,null,162,5.5958549222797929E-2]
["BPA ajusté (A)",0.71381239714755884,0.76139652654134138,null,-5.0000000000000044E-2,-6.5789473684210578E-2,null,3.3538123971475589,3.1943065210195298,null,0.16000000000000014,5.0156739811912272E-2]
["n.s. : non significatif"]
[]
["(A) Le BAIIA ajusté représente un total des mesures sectorielles, le bénéfice net ajusté est une mesure financière non conforme aux PCGR et le BPA ajusté est un ratio non conforme aux PCGR. Voir la note 3.3 Total des mesures sectorielles, la note 3.1 Mesures financières non conformes aux PCGR et la note 3.2 Ratios non conformes aux PCGR dans les notes annexes du présent rapport pour en savoir plus sur ces mesures. "]
[]
["(B) La marge du BAIIA ajusté est définie comme le BAIIA ajusté divisé par les produits d’exploitation."]

{"sheet":"EPMFormattingSheet","index":2,"n_rows":125,"n_cols":26,"rows_kept":125,"cut":false,"hidden":true,"merged":[[6,14,18,14],[21,14,28,14],[32,14,38,14],[120,2,122,2],[123,2,124,2],[119,4,119,6],[119,7,119,11],[97,1,97,11],[98,1,98,11],[101,2,103,2],[104,2,106,2],[100,4,100,6],[100,8,100,10],[99,1,106,1],[79,2,81,2],[82,2,84,2],[118,1,126,1],[121,7,121,11],[109,2,111,2],[112,2,114,2],[108,4,108,6],[108,8,108,10],[107,1,114,1],[117,1,117,11],[76,2,78,2],[75,8,75,10],[74,1,94,1],[64,2,66,2],[85,2,87,2],[88,2,90,2],[75,4,75,6],[67,2,69,2],[70,2,71,2],[91,2,92,2],[61,2,63,2],[54,4,54,6],[8,4,8,6],[8,8,8,10],[6,1,26,1],[15,3,16,3],[54,8,54,10],[53,1,73,1],[55,2,57,2],[58,2,60,2],[15,2,16,2],[29,8,29,10],[51,1,51,11],[52,1,52,11],[30,2,32,2],[33,2,35,2],[36,2,37,2],[29,4,29,6],[27,1,47,1],[36,3,37,3],[0,1,0,11],[4,1,4,11],[5,1,5,11],[9,2,11,2],[12,2,14,2]]}
[null,"EPM Formatting Sheet",null,null,null,null,null,null,null,null,null,null,null,null,null,null,null,null,null,null,null,null,null,null,1,false]
[]
[null,"Note: The format settings in lower sections overrides the ones in upper section if there are conflicts."]
[]
[null,"Hierarchy Level Formatting",null,null,null,null,null,null,null,null,null,null,null,null,"Help"]
[null,null,null,null,null,null,null,null,null,null,null,null,null,null,"Formatting and \"Use\" Column:"]
[null,"Row",null,null,null,null,null,null,null,null,null,null,null,null,"In the \"1000\" and \"Label\" cells, define the format you want by using the standard Microsoft Office Excel cell formatting functions.\r\nBy default, all the format settings are applied and \"ALL\" is displayed in the \"Use\" column.\r\n\r\nYou can then specify which settings of the defined format you want to apply or define additional settings.To do so, double-click in a \"Use\" cell and define the format settings in the dialog box that opens, or directly enter the format settings in a \"Use\" cell, using a specific syntax, for example: (FontBold = Y) | (FontSize = 18).\r\n\t\t"]
[]
[null,null,null,null,"Data",null,null,"Use","Header",null,null,"Use"]
[]
[null,null,null,"Default Format",null,10000,null,"All",null,"Label",null,"All"]
[]
[]
[null,null,null,"Base Level Format",null,10000,null,"All",null,"Label",null,"All"]
[]
[null,null,null,"Formatting on Specific Level:"]
[]
[null,null,null,{"$f":"IF(Y1=2, \"Level 1\", IF(Z1=TRUE, IF(A26-1=0, \"Lowest Level\",\"Lowest Level -\"&(A26-1)), \"Level 1\"))","v":"Level 1"},null,10000,null,"All",null,"Label",null,"All"]
[]
[]
[null,null,null,{"$f":"IF(Y1=2, \"Level 2\", IF(Z1=TRUE, IF(A26-2=0, \"Lowest Level\",\"Lowest Level -\"&(A26-2)), \"Level 2\"))","v":"Level 2"},null,10000,null,"All",null,"Label",null,"All",null,null,"Priority to Row or Column"]
[null,null,null,null,null,null,null,null,null,null,null,null,null,null,"These options enable you to specify which one of the defined formats for rows or for columns will be applied first in case of conflicts. When you click the \"Priority to Column\" option, the \"Column\" section is displayed first in the formatting section and the \"Row\" section is displayed in second position in the formatting section and the precedence rules apply."]
[]
[null,null,null,{"$f":"IF(Y1=2, \"Level 3\", IF(Z1=TRUE, IF(A26-3=0, \"Lowest Level\",\"Lowest Level -\"&(A26-3)), \"Level 3\"))","v":"Level 3"},null,10000,null,"All",null,"Label",null,"All"]
[]
[3]
[]
[null,"Column"]
[]
[null,null,null,null,"Data",null,null,"Use","Header",null,null,"Use"]
[]
[null,null,null,"Default Format",null,10000,null,"All",null,"Label",null,"All",null,null,"Inner or Outer Dimension:"]
[null,null,null,null,null,null,null,null,null,null,null,null,null,null,"If a row or column axis contains more than one dimension, you can specify which dimension you want the defined format to be applied to; \"Inner dimension\" being the last dimension, Outer dimension\" being the first dimension in the axis."]
[]
[null,null,null,"Base Level Format",null,10000,null,"All",null,"Label",null,"All"]
[]
[null,null,null,"Formatting on Specific Level:"]
[]
[null,null,null,{"$f":"IF(Y1=2, \"Level 1\", IF(Z1=TRUE, IF(A47-1=0, \"Lowest Level\",\"Lowest Level -\"&(A47-1)), \"Level 1\"))","v":"Level 1"},null,10000,null,"All",null,"Label",null,"All"]
[]
[]
[null,null,null,{"$f":"IF(Y1=2, \"Level 2\", IF(Z1=TRUE, IF(A47-2=0, \"Lowest Level\",\"Lowest Level -\"&(A47-2)), \"Level 2\"))","v":"Level 2"},null,10000,null,"All",null,"Label",null,"All"]
[]
[]
[null,null,null,{"$f":"IF(Y1=2, \"Level 3\", IF(Z1=TRUE, IF(A47-3=0, \"Lowest Level\",\"Lowest Level -\"&(A47-3)), \"Level 3\"))","v":"Level 3"},null,10000,null,"All",null,"Label",null,"All"]
[]
[3]
[]
[]
[]
[]
[null,"Dimension Member/Property Formatting"]
[]
[null,"Row"]
[null,null,null,null,"Data",null,null,"Use","Header",null,null,"Use"]
[]
[null,null,null,"Custom Member Default Format",null,10000,null,"All",null,"Label",null,"All"]
[]
[]
[null,null,null,"Calculated Member Default Format",null,10000,null,"All",null,"Label",null,"All"]
[]
[]
[null,null,null,"Inputable Member Default Format",null,10000,null,"All",null,"Label",null,"All"]
[]
[]
[null,null,null,"Local Member Default Format",null,10000,null,"All",null,"Label",null,"All"]
[]
[]
[null,null,null,"Changed Member Default Format",null,10000,null,"All",null,"Label",null,"All"]
[]
[]
[null,null,null,"Formatting on Specific Member/Property:"]
[]
[]
[null,"Column"]
[null,null,null,null,"Data",null,null,"Use","Header",null,null,"Use"]
[]
[null,null,null,"Custom Member Default Format",null,10000,null,"All",null,"Label",null,"All"]
[]
[]
[null,null,null,"Calculated Member Default Format",null,10000,null,"All",null,"Label",null,"All"]
[]
[]
[null,null,null,"Inputable Member Default Format",null,10000,null,"All",null,"Label",null,"All"]
[]
[]
[null,null,null,"Local Member Default Format",null,10000,null,"All",null,"Label",null,"All"]
[]
[]
[null,null,null,"Changed Member Default Format",null,10000,null,"All",null,"Label",null,"All"]
[]
[]
[null,null,null,"Formatting on Specific Member/Property:"]
[]
[]
[]
[]
[null,"Row and Column Banding"]
[]
[null,"Row"]
[null,null,null,null,"Data",null,null,"Use","Header",null,null,"Use"]
[]
[null,null,null,"Odd Formatting",null,10000,null,"All",null,"Label",null,"All"]
[]
[]
[null,null,null,"Even Formatting",null,10000,null,"All",null,"Label",null,"All"]
[]
[null,"Column"]
[null,null,null,null,"Data",null,null,"Use","Header",null,null,"Use"]
[]
[null,null,null,"Odd Formatting",null,10000,null,"All",null,"Label",null,"All"]
[]
[]
[null,null,null,"Even Formatting",null,10000,null,"All",null,"Label",null,"All"]
[]
[]
[]
[null,"Page Axis Formatting"]
[]
[null,null,null,null,"Header",null,null,"Use"]
[]
[null,null,null,"Default Format",null,"Label",null,"All"]
[]
[]
[null,null,null,"Formatting on Specific Dimension:"]

{"sheet":"BCE Inc. IS HIST p3","index":3,"n_rows":51,"n_cols":14,"rows_kept":51,"cut":false,"hidden":false,"merged":[]}
[null,null,null,null,null,null,null,null,null,null,null,null,null,"BCE"]
[null,null,null,null,null,null,null,null,null,null,null,null,null,"Données opérationnelles consolidées – Tendance historique"]
[]
[]
[null,"TOTAL",null,null,null,null,null,null,"TOTAL"]
["(en millions de dollars canadiens, sauf les montants liés aux actions) (non audité)","2022",null,"T4 22","T3 22","T2 22","T1 22",null,"2021",null,"T4 21","T3 21","T2 21","T1 21"]
["Produits d’exploitation"]
["Tirés des services ",20956,null,5353,5193,5233,5177,null,20350,null,5243,5099,5040,4968]
["Tirés des produits",3218,null,1086,831,628,673,null,3099,null,966,737,658,738]
["Total des produits d’exploitation",24174,null,6439,6024,5861,5850,null,23449,null,6209,5836,5698,5706]
["Coûts d’exploitation",-13975,null,-4002,-3436,-3271,-3266,null,-13556,null,-3779,-3278,-3222,-3277]
["BAIIA ajusté ",10199,null,2437,2588,2590,2584,null,9893,null,2430,2558,2476,2429]
["Marge du BAIIA ajusté ",0.42189956151236868,null,0.37847491846560027,0.42961487383798141,0.44190411192629242,0.44170940170940171,null,0.4218943238517634,null,0.39136736994685134,0.43831391363947908,0.43453843453843455,0.42569225376796355]
["Coûts liés aux indemnités de départ, aux acquisitions et autres",-94,null,-19,-22,-40,-13,null,-209,null,-63,-50,-7,-89]
["Amortissement des immobilisations corporelles",-3660,null,-922,-914,-933,-891,null,-3627,null,-925,-902,-905,-895]
["Amortissement des immobilisations incorporelles",-1063,null,-270,-267,-266,-260,null,-982,null,-251,-245,-248,-238]
["Charges financières"]
["Charges d’intérêts",-1146,null,-319,-298,-269,-260,null,-1082,null,-275,-272,-268,-267]
["Rendements (intérêts) nets au titre des régimes d’avantages postérieurs à l’emploi",51,null,13,13,7,18,null,-20,null,-5,-5,-5,-5]
["Perte de valeur d’actifs",-279,null,-150,-21,-106,-2,null,-197,null,-30,0,-164,-3]
["Autres (charges) produits",-115,null,19,-130,-97,93,null,160,null,26,35,91,8]
["Impôt sur le résultat",-967,null,-222,-178,-232,-335,null,-1044,null,-249,-306,-236,-253]
["Bénéfice net ",2926,null,567,771,654,934,null,2892,null,658,813,734,687]
[]
["Bénéfice net attribuable aux :"]
["Actionnaires ordinaires",2716,null,528,715,596,877,null,2709,null,625,757,685,642]
["Actionnaires privilégiés",152,null,44,39,35,34,null,131,null,33,34,32,32]
["Détenteurs de participations ne donnant pas le contrôle",58,null,-5,17,23,23,null,52,null,0,22,17,13]
["Bénéfice net",2926,null,567,771,654,934,null,2892,null,658,813,734,687]
[]
["Bénéfice net par action ordinaire – de base et dilué",2.9797037849698298,null,0.57873813150774245,0.78096565346208724,0.66,0.96,null,2.9890764647467729,null,0.68758557573517731,0.83170647773464712,0.76,0.70978441127694858]
[]
["Dividendes par action ordinaire",3.68,null,0.92,0.92,0.92,0.92,null,3.5,null,0.875,0.875,0.875,0.875]
[]
["Nombre moyen pondéré d’actions ordinaires en circulation – de base (en millions)",911.5,null,912,911.9,911.9,910.1,null,906.3,null,908.8,906.9,905,904.5]
["Nombre moyen pondéré d’actions ordinaires en circulation – dilué (en millions)",912,null,912.2,912.3,912.8,910.8,null,906.7,null,909.6,907.6,905.3,904.5]
["Nombre d’actions ordinaires en circulation (en millions)",912,null,912,911.9,911.9,911.8,null,909,null,909,908.8,905.7,904.6]
[]
["Bénéfice net ajusté et BPA ajusté"]
["Bénéfice net attribuable aux actionnaires ordinaires",2716,null,528,715,596,877,null,2709,null,625,757,685,642]
["Éléments de rapprochement :"]
["Coûts liés aux indemnités de départ, aux acquisitions et autres",94,null,19,22,40,13,null,209,null,63,50,7,89]
["Pertes (profits) nets liés à la valeur de marché sur dérivés utilisés à titre de couverture\n   économique des régimes de rémunération fondée sur des actions qui sont \n   réglés en instruments de capitaux propres",53,null,-27,74,81,-75,null,-278,null,-57,-61,-100,-60]
["Pertes nettes sur participations mises en équivalence dans des entreprises \n   associées et des coentreprises",42,null,0,0,42,0,null,49,null,35,0,14,0]
["(Profits nets) pertes nettes sur placements",-24,null,29,0,-16,-37,null,6,null,6,0,0,0]
["Coûts liés au remboursement anticipé de la dette",18,null,0,0,0,18,null,53,null,0,0,0,53]
["Perte de valeur d’actifs",279,null,150,21,106,2,null,197,null,30,0,164,3]
["Impôt lié aux éléments de rapprochement ci-dessus",-117,null,-37,-31,-62,13,null,-48,null,-9,2,-18,-23]
["Participations ne donnant pas le contrôle liées aux éléments de rapprochement ci-dessus",-4,null,-8,0,4,0,null,-2,null,-1,0,-1,0]
["Bénéfice net ajusté ",3057,null,654,801,791,811,null,2895,null,692,748,751,704]
["BPA ajusté",3.3538123971475589,null,0.71,0.88,0.87,0.89,null,3.1943065210195303,null,0.76139652654134138,0.82464206035638044,0.82993736474646274,0.7783305693753455]

{"sheet":"BCE Inc. Seg Info Summary p4","index":4,"n_rows":42,"n_cols":12,"rows_kept":42,"cut":false,"hidden":false,"merged":[]}
[null,null,null,null,null,null,null,null,null,null,null,"BCE (1) (2)"]
[null,null,null,null,null,null,null,null,null,null,null,"Informations sectorielles"]
[]
[]
["(en millions de dollars canadiens, sauf indication contraire) (non audité)","T4\n2022","T4\n2021",null,"Variation \n($)","% de \nvariation",null,"TOTAL\n 2022","TOTAL\n2021",null,"Variation \n($)","% de \nvariation"]
[]
["Produits d’exploitation"]
["Services sans fil de Bell",2666,2475,null,191,7.7171717171717169E-2,null,9588,8999,null,589,6.5451716857428607E-2]
["Services sur fil de Bell",3094,3079,null,15,4.871711594673595E-3,null,12148,12178,null,-30,-2.4634586960091969E-3]
["Bell Média",889,849,null,40,4.7114252061248529E-2,null,3254,3036,null,218,7.180500658761528E-2]
["Éliminations intersectorielles",-210,-194,null,-16,-8.247422680412371E-2,null,-816,-764,null,-52,-6.8062827225130892E-2]
["Au total",6439,6209,null,230,3.70430020937349E-2,null,24174,23449,null,725,3.0918162821442278E-2]
[]
["Coûts d’exploitation"]
["Services sans fil de Bell",-1676,-1524,null,-152,-9.9737532808398949E-2,null,-5451,-5146,null,-305,-5.926933540614069E-2]
["Services sur fil de Bell",-1776,-1753,null,-23,-1.3120365088419851E-2,null,-6831,-6863,null,32,4.6626839574530092E-3]
["Bell Média",-760,-696,null,-64,-9.1954022988505746E-2,null,-2509,-2311,null,-198,-8.5677196019039378E-2]
["Éliminations intersectorielles",210,194,null,16,8.247422680412371E-2,null,816,764,null,52,6.8062827225130892E-2]
["Au total",-4002,-3779,null,-223,-5.9010320190526593E-2,null,-13975,-13556,null,-419,-3.0908822661552079E-2]
[]
["BAIIA ajusté"]
["Services sans fil de Bell",990,951,null,39,4.1009463722397478E-2,null,4137,3853,null,284,7.370879833895666E-2]
["Marge",0.371,0.38400000000000001,null,null,-1.3000000000000012,null,0.43099999999999999,0.42815868429825538,null,null,0.30000000000000027]
["Services sur fil de Bell",1318,1326,null,-8,-6.0331825037707393E-3,null,5317,5315,null,2,0]
["Marge ",0.42599999999999999,0.43099999999999999,null,null,-0.50000000000000044,null,0.438,0.43644276564296269,null,null,0.20000000000000018]
["Bell Média",129,153,null,-24,-0.15686274509803921,null,745,725,null,20,2.7586206896551724E-2]
["Marge",0.14499999999999999,0.18,null,null,-3.5000000000000004,null,0.22900000000000001,0.23880105401844501,null,null,-1]
["Au total",2437,2430,null,7,2.8806584362139919E-3,null,10199,9893,null,306,3.0930961285757605E-2]
["Marge",0.378,0.39100000000000001,null,null,-1.3000000000000012,null,0.42199999999999999,0.4218943238517634,null,null,0]
[]
["Dépenses d’investissement"]
["Services sans fil de Bell",308,273,null,-35,-0.12820512820512819,null,1084,1120,null,36,3.214285714285714E-2]
["Intensité du capital(A) (4)",0.11552888222055514,0.11030303030303031,null,null,-0.60000000000000053,null,0.11305798915310805,0.12445827314146016,null,null,1.0999999999999996]
["Services sur fil de Bell",1251,1141,null,-110,-9.6406660823838738E-2,null,3887,3612,null,-275,-7.6135105204872641E-2]
["Intensité du capital ",0.40433096315449257,0.37057486196817147,null,null,-3.3000000000000029,null,0.3199703654922621,0.29660042699950728,null,null,-2.300000000000002]
["Bell Média",79,52,null,-27,-0.51923076923076927,null,162,120,null,-42,-0.35]
["Intensité du capital ",8.8863892013498313E-2,6.1248527679623084E-2,null,null,-2.8,null,4.9784880147510757E-2,3.9525691699604744E-2,null,null,-1.0000000000000002]
["Au total",1638,1466,null,-172,-0.11732605729877217,null,5133,4852,null,-281,-5.7914262159934046E-2]
["Intensité du capital ",0.25438732722472435,0.23610887421484941,null,null,-1.8000000000000016,null,0.21233556713824769,0.20691713932363853,null,null,-0.50000000000000044]
[]
[]
["(A) L’intensité du capital correspond aux dépenses d’investissement divisées par les produits d’exploitation."]

{"sheet":"BCE Inc. Seg Info HIST p5","index":5,"n_rows":38,"n_cols":14,"rows_kept":38,"cut":false,"hidden":false,"merged":[]}
[null,null,null,null,null,null,null,null,null,null,null,null,null,"BCE (2)"]
[null,null,null,null,null,null,null,null,null,null,null,null,null,"Informations sectorielles – Tendance historique"]
[]
["(en millions de dollars canadiens, sauf indication contraire) (non audité)","TOTAL              2022",null,"T4 22","T3 22","T2 22","T1 22",null,"TOTAL\n2021",null,"T4 21","T3 21","T2 21","T1 21"]
[]
["Produits d’exploitation"]
["Services sans fil de Bell",9588,null,2666,2466,2246,2210,null,8999,null,2475,2296,2128,2100]
["Services sur fil de Bell",12148,null,3094,3046,2995,3013,null,12178,null,3079,3015,3003,3081]
["Bell Média",3254,null,889,719,821,825,null,3036,null,849,719,755,713]
["Éliminations intersectorielles",-816,null,-210,-207,-201,-198,null,-764,null,-194,-194,-188,-188]
["Au total ",24174,null,6439,6024,5861,5850,null,23449,null,6209,5836,5698,5706]
[]
["Coûts d’exploitation"]
["Services sans fil de Bell",-5451,null,-1676,-1377,-1197,-1201,null,-5146,null,-1524,-1286,-1159,-1177]
["Services sur fil de Bell",-6831,null,-1776,-1729,-1680,-1646,null,-6863,null,-1753,-1682,-1710,-1718]
["Bell Média",-2509,null,-760,-537,-595,-617,null,-2311,null,-696,-504,-541,-570]
["Éliminations intersectorielles",816,null,210,207,201,198,null,764,null,194,194,188,188]
["Au total ",-13975,null,-4002,-3436,-3271,-3266,null,-13556,null,-3779,-3278,-3222,-3277]
[]
["BAIIA ajusté"]
["Services sans fil de Bell",4137,null,990,1089,1049,1009,null,3853,null,951,1010,969,923]
["Marge",0.43099999999999999,null,0.371,0.442,0.46700000000000003,0.45700000000000002,null,0.42799999999999999,null,0.38400000000000001,0.43989547038327526,0.45500000000000002,0.44]
["Services sur fil de Bell",5317,null,1318,1317,1315,1367,null,5315,null,1326,1333,1293,1363]
["Marge",0.438,null,0.42599999999999999,0.432,0.439,0.45400000000000001,null,0.436,null,0.43099999999999999,0.44212271973466005,0.43099999999999999,0.442]
["Bell Média",745,null,129,182,226,208,null,725,null,153,215,214,143]
["Marge",0.22900000000000001,null,0.14499999999999999,0.253,0.27500000000000002,0.252,null,0.23899999999999999,null,0.18,0.29902642559109877,0.28299999999999997,0.20100000000000001]
["Au total ",10199,null,2437,2588,2590,2584,null,9893,null,2430,2558,2476,2429]
["Marge",0.42199999999999999,null,0.378,0.43,0.442,0.442,null,0.42199999999999999,null,0.39100000000000001,0.43831391363947908,0.435,0.42599999999999999]
[]
["Dépenses d’investissement"]
["Services sans fil de Bell",1084,null,308,248,280,248,null,1120,null,273,255,306,286]
["Intensité du capital",0.11305798915310805,null,0.11552888222055514,0.10056772100567721,0.1246660730186999,0.11221719457013575,null,0.12445827314146016,null,0.11030303030303031,0.11106271777003485,0.14379699248120301,0.1361904761904762]
["Services sur fil de Bell",3887,null,1251,1038,910,688,null,3612,null,1141,884,880,707]
["Intensité du capital",0.3199703654922621,null,0.40433096315449257,0.34077478660538413,0.30383973288814692,0.22834384334550281,null,0.29660042699950728,null,0.37057486196817147,0.29320066334991707,0.29304029304029305,0.22947095098993833]
["Bell Média",162,null,79,31,29,23,null,120,null,52,25,24,19]
["Intensité du capital",4.9784880147510757E-2,null,8.8863892013498313E-2,4.3115438108484005E-2,3.5322777101096221E-2,2.7878787878787878E-2,null,3.9525691699604744E-2,null,6.1248527679623084E-2,3.4770514603616132E-2,3.1788079470198675E-2,2.6647966339410939E-2]
["Au total",5133,null,1638,1317,1219,959,0,4852,0,1466,1164,1210,1012]
["Intensité du capital",0.21233556713824769,null,0.25438732722472435,0.21862549800796813,0.20798498549735539,0.16393162393162394,null,0.20691713932363853,null,0.23610887421484941,0.19945167923235094,0.21235521235521235,0.17735716789344549]

{"sheet":"Bell Wireless Summary p6","index":6,"n_rows":44,"n_cols":13,"rows_kept":44,"cut":false,"hidden":false,"merged":[[44,0,44,12],[43,1,43,12]]}
[]
[null,null,null,null,null,null,null,null,null,null,null,null,"Services sans fil de Bell (1) (2)"]
[]
[]
[null,null,"T4",null,"T4",null,"% de",null,"TOTAL",null,"TOTAL",null,"% de"]
["(en millions de dollars canadiens, sauf indication contraire) (non audité)",null,"2022",null,"2021",null,"variation",null,"2022",null,"2021",null,"variation"]
["Services sans fil de Bell",null,null,null," ",null,null,null,null,null," "]
["Produits d’exploitation"]
["Produits externes tirés des services",null,1735,null,1641,null,5.7282145033516148E-2,null,6821,null,6355,null,7.3328088119590878E-2]
["Produits intersectoriels tirés des services",null,12,null,11,null,9.0909090909090912E-2,null,44,null,45,null,-2.2222222222222223E-2]
["Produits d’exploitation tirés des services",null,1747,null,1652,null,5.7506053268765137E-2,null,6865,null,6400,null,7.2656250000000006E-2]
[null,"Produits externes tirés des produits",917,null,821,null,0.11693057247259439,null,2714,null,2593,null,4.6664095642113379E-2]
[null,"Produits intersectoriels tirés des produits",2,null,2,null,0,null,9,null,6,null,0.5]
["Produits d’exploitation tirés des produits",null,919,null,823,null,0.1166464155528554,null,2723,null,2599,null,4.7710657945363603E-2]
["Total des produits externes ",null,2652,null,2462,null,7.7173030056864336E-2,null,9535,null,8948,null,6.5601251676352251E-2]
["Total des produits d’exploitation",null,2666,null,2475,null,7.7171717171717169E-2,null,9588,null,8999,null,6.5451716857428607E-2]
["Coûts d’exploitation",null,-1676,null,-1524,null,-9.9737532808398949E-2,null,-5451,null,-5146,null,-5.926933540614069E-2]
["BAIIA ajusté",null,990,null,951,null,4.1009463722397478E-2,null,4137,null,3853,null,7.370879833895666E-2]
["Marge du BAIIA ajusté",null,0.37134283570892723,null,0.38424242424242422,null,-1.3000000000000012,null,0.43147684605757197,null,0.42815868429825538,null,0.30000000000000027]
["Dépenses d’investissement ",null,308,null,273,null,-0.12820512820512819,null,1084,null,1120,null,3.214285714285714E-2]
["Intensité du capital ",null,0.11552888222055514,null,0.11030303030303031,null,-0.60000000000000053,null,0.11305798915310805,null,0.12445827314146016,null,1.0999999999999996]
[]
["Abonnés des services de téléphonie mobile (4)"]
["Activations brutes d’abonnés",null,605034,null,495076,null,0.22210327303282729,null,1953912,null,1653771,null,0.18148885184224417]
["Services postpayés ",null,467294,null,373621,null,0.25071663530690191,null,1355772,null,1201659,null,0.12825019410664756]
["Services prépayés",null,137740,null,121455,null,0.13408258202626488,null,598140,null,452112,null,0.32299076335067417]
["Activations (pertes) nettes d’abonnés",null,122621,null,109726,null,0.11752000437453293,null,489901,null,294842,null,0.6615712822460843]
["Services postpayés ",null,154617,null,109527,null,0.41167931195047797,null,439842,null,301706,null,0.45784969473593501]
[null,"Services prépayés ",-31996,null,199,null,"n.s.",null,50059,null,-6864,null,"n.s."]
["Abonnés à la fin de la période",null,9949086,null,9459185.1253664009,null,5.179102302584683E-2,null,9949086,null,9459185.1253664009,null,5.179102302584683E-2]
["Services postpayés",null,9069887,null,8630045.2253664006,null,5.0966334839215789E-2,null,9069887,null,8630045.2253664006,null,5.0966334839215789E-2]
["Services prépayés",null,879199,null,829139.9,null,6.0374732900925376E-2,null,879199,null,829139.9,null,6.0374732900925376E-2]
["Revenu moyen par utilisateur (RMU) combiné ($/mois) (A) (4)",null,58.88,null,58.608488800000003,null,4.6326258458313811E-3,null,59.3,null,57.664423800000002,null,2.8363696231019923E-2]
[]
["Taux de désabonnement combiné (%) (moyen par mois) (4)",null,1.6299999999999999E-2,null,1.37295E-2,null,-0.25999999999999979,null,1.2699999999999999E-2,null,1.23074E-2,null,-3.9999999999999931E-2]
["Services postpayés",null,1.2200000000000001E-2,null,1.0782E-2,null,-0.14000000000000001,null,9.1999999999999998E-3,null,9.3212E-3,null,9.9999999999999395E-3]
["Services prépayés",null,5.74E-2,null,4.4151200000000002E-2,null,-1.3199999999999996,null,4.8500000000000001E-2,null,4.3075099999999998E-2,null,-0.54000000000000026]
["Abonnés des services d’appareils mobiles connectés (4)"]
["Activations nettes d’abonnés",null,104447,null,38998,null,"n.s.",null,202024,null,193641,null,4.3291451707024857E-2]
["Abonnés à la fin de la période",null,2451818,null,2249794,null,8.9796665828071373E-2,null,2451818,null,2249794,null,8.9796665828071373E-2]
[]
["n.s. : non significatif"]
[]
["(A)","Le RMU combiné des abonnés utilisant des téléphones mobiles est calculé en divisant les produits d’exploitation des Services sans fil par la clientèle d’abonnés des services de téléphonie mobile moyenne au cours d’une période donnée et est exprimé en dollars par mois."]

{"sheet":"Bell Wireless HIST p7","index":7,"n_rows":37,"n_cols":15,"rows_kept":37,"cut":false,"hidden":false,"merged":[[38,1,38,14],[39,1,39,14],[2,0,2,1]]}
[null,null,null,null,null,null,null,null,null,null,null,null,null,null,"Services sans fil de Bell – Tendance historique (2)"]
[]
["(en millions de dollars canadiens, sauf indication contraire) (non audité)",null,"TOTAL\n2022",null,"T4 22","T3 22","T2 22","T1 22",null,"TOTAL\n2021",null,"T4 21","T3 21","T2 21","T1 21"]
["Services sans fil de Bell"]
["Produits d’exploitation"]
["Produits externes tirés des services",null,6821,null,1735,1759,1692,1635,null,6355,null,1641,1642,1569,1503]
["Produits intersectoriels tirés des services",null,44,null,12,10,11,11,null,45,null,11,12,11,11]
["Produits d’exploitation tirés des services",null,6865,null,1747,1769,1703,1646,null,6400,null,1652,1654,1580,1514]
["Produits externes tirés des produits",null,2714,null,917,692,542,563,null,2593,null,821,642,546,584]
["Produits intersectoriels tirés des produits",null,9,null,2,5,1,1,null,6,null,2,0,2,2]
["Produits d’exploitation tirés des produits",null,2723,null,919,697,543,564,0,2599,null,823,642,548,586]
["Total des produits externes ",null,9535,null,2652,2451,2234,2198,null,8948,null,2462,2284,2115,2087]
["Total des produits d’exploitation",null,9588,null,2666,2466,2246,2210,null,8999,null,2475,2296,2128,2100]
["Coûts d’exploitation",null,-5451,null,-1676,-1377,-1197,-1201,null,-5146,null,-1524,-1286,-1159,-1177]
["BAIIA ajusté ",null,4137,null,990,1089,1049,1009,null,3853,null,951,1010,969,923]
["Marge du BAIIA ajusté",null,0.43147684605757197,null,0.37134283570892723,0.442,0.4670525378450579,0.45656108597285067,null,0.42815868429825538,null,0.38424242424242422,0.43989547038327526,0.45535714285714285,0.43952380952380954]
[]
["Dépenses d’investissement",null,1084,null,308,248,280,248,0,1120,0,273,255,306,286]
["Intensité du capital ",null,0.11305798915310805,null,0.11552888222055514,0.10056772100567721,0.1246660730186999,0.11221719457013575,null,0.12445827314146016,null,0.11030303030303031,0.11106271777003485,0.14379699248120301,0.1361904761904762]
[]
["Abonnés des services de téléphonie mobile"]
["Activations brutes d’abonnés",null,1953912,null,605034,583700,415270,349908,null,1653771,null,495076,470165,348403,340127]
["Services postpayés ",null,1355772,null,467294,391165,266600,230713,null,1201659,null,373621,336328,242720,248990]
["Services prépayés",null,598140,null,137740,192535,148670,119195,null,452112,null,121455,133837,105683,91137]
["Activations (pertes) nettes d’abonnés",null,489901,null,122621,224343,110761,32176,null,294842,null,109726,136464,46247,2405]
["Services postpayés ",null,439842,null,154617,167798,83197,34230,null,301706,null,109527,114821,44433,32925]
[null,"Services prépayés ",50059,null,-31996,56545,27564,-2054,null,-6864,null,199,21643,1814,-30520]
["Abonnés à la fin de la période",null,9949086,null,9949086,9826465.1253664009,9602122.1253664009,9491361.1253664009,null,9459185.1253664009,null,9459185.1253664009,9349459.1253664009,9212995.1253664009,9166748]
["Services postpayés",null,9069887,null,9069887,8915270.2253664006,8747472.2253664006,8664275.2253664006,null,8630045.2253664006,null,8630045.2253664006,8520518.2253664006,8405697.2253664006,8361264]
["Services prépayés",null,879199,null,879199,911194.9,854649.9,827085.9,null,829139.9,null,829139.9,828940.9,807297.9,805484]
["Revenu moyen par utilisateur (RMU) combiné ($/mois)",null,59.3,null,58.88,60.76,59.5431934,57.983489400000003,null,57.664423800000002,null,58.608488800000003,59.466230600000003,57.360305699999998,55.174383300000002]
["Taux de désabonnement combiné (%) (moyen par mois)",null,1.2699999999999999E-2,null,1.6299999999999999E-2,1.24E-2,1.0737500000000001E-2,1.12421E-2,null,1.23074E-2,null,1.37295E-2,1.20897E-2,1.1043499999999999E-2,1.23E-2]
["Services postpayés",null,9.1999999999999998E-3,null,1.2200000000000001E-2,8.9999999999999993E-3,7.5217000000000001E-3,7.9129000000000005E-3,null,9.3212E-3,null,1.0782E-2,9.2504000000000006E-3,8.2737000000000002E-3,8.8999999999999999E-3]
["Services prépayés",null,4.8500000000000001E-2,null,5.74E-2,4.58E-2,4.4090699999999997E-2,4.6051099999999998E-2,null,4.3075099999999998E-2,null,4.4151200000000002E-2,4.1468999999999999E-2,3.9803400000000003E-2,4.6800000000000001E-2]
["Abonnés des services d’appareils mobiles connectés"]
["Activations (pertes) nettes d’abonnés ",null,202024,null,104447,49044,-344,48877,null,193641,null,38998,33035,47449,74159]
["Abonnés à la fin de la période",null,2451818,null,2451818,2347371,2298327,2298671,null,2249794,null,2249794,2210796,2177761,2130312]

{"sheet":"Bell Wireline Summary  p8","index":8,"n_rows":43,"n_cols":13,"rows_kept":43,"cut":false,"hidden":false,"merged":[[44,0,45,7],[41,1,41,12],[42,1,43,12]]}
[]
[null,null,null,null,null,null,null,null,null,null,null,null,"Services sur fil de Bell (1) (2)"]
[]
[]
[null,null,"T4",null,"T4",null,"% de",null,"TOTAL",null,"TOTAL",null,"% de"]
["(en millions de dollars canadiens, sauf indication contraire) (non audité)",null,2022,null,2021,null," variation",null,2022,null,2021,null," variation"]
["Services sur fil de Bell"]
["Produits d’exploitation"]
["Services de données ",null,2006,null,1986,null,1.0070493454179255E-2,null,7920,null,7871,null,6.225384322195401E-3]
["Tirés des services voix",null,736,null,779,null,-5.5198973042362001E-2,null,3002,null,3154,null,-4.8192771084337352E-2]
["Tirés d’autres services",null,77,null,75,null,2.6666666666666668E-2,null,309,null,289,null,6.9204152249134954E-2]
["Produits externes tirés des services",null,2819,null,2840,null,-7.3943661971830983E-3,null,11231,null,11314,null,-7.3360438394908965E-3]
["Produits intersectoriels tirés des services",null,105,null,94,null,0.11702127659574468,null,412,null,358,null,0.15083798882681565]
["Produits d’exploitation tirés des services",null,2924,null,2934,null,-3.4083162917518746E-3,null,11643,null,11672,null,-2.4845784784098698E-3]
["Services de données ",null,157,null,132,null,0.18939393939393939,null,459,null,463,null,-8.6393088552915772E-3]
["Équipements et autres",null,12,null,13,null,-7.6923076923076927E-2,null,45,null,43,null,4.6511627906976744E-2]
["Produits externes tirés des produits",null,169,null,145,null,0.16551724137931034,null,504,null,506,null,-3.952569169960474E-3]
["Produits intersectoriels tirés des produits",null,1,null,0,null,"n.s.",null,1,null,0,null,"n.s."]
["Produits d’exploitation tirés des produits",null,170,null,145,null,0.17241379310344829,null,505,null,506,null,-1.976284584980237E-3]
["Total des produits externes",null,2988,null,2985,null,1.0050251256281408E-3,null,11735,null,11820,null,-7.1912013536379014E-3]
["Total des produits d’exploitation",null,3094,null,3079,null,4.871711594673595E-3,null,12148,null,12178,null,-2.4634586960091969E-3]
["Coûts d’exploitation",null,-1776,null,-1753,null,-1.3120365088419851E-2,null,-6831,null,-6863,null,4.6626839574530092E-3]
["BAIIA ajusté",null,1318,null,1326,null,-6.0331825037707393E-3,null,5317,null,5315,null,0]
["Marge du BAIIA ajusté",null,0.42599999999999999,null,0.43099999999999999,null,-0.50000000000000044,null,0.438,null,0.43644276564296269,null,0.20000000000000018]
["Dépenses d’investissement ",null,1251,null,1141,null,-9.6406660823838738E-2,null,3887,null,3612,null,-7.6135105204872641E-2]
["Intensité du capital ",null,0.40433096315449257,null,0.37057486196817147,null,-3.3000000000000029,null,0.3199703654922621,null,0.29660042699950728,null,-2.300000000000002]
["Abonnés des services Internet haute vitesse de détail (4)"]
["Activations nettes d’abonnés des services de détail",null,63465.865849099995,null,47618,null,0.33281250470620344,null,201762,null,152285,null,0.32489739632925108]
["Abonnés des services de détail à la fin de la période (A) (B)",null,4258570,null,3861652.7233591001,null,0.10278430119828,null,4258570,null,3861652.7233591001,null,0.10278430119828]
["Abonnés des services de télé de détail (4)"]
["Activations (pertes) nettes d’abonnés des services de détail",null,14183,null,6049,null,"n.s.",null,5148,null,2530,null,"n.s."]
["Services de télévision sur protocole Internet (télé IP) ",null,40209,null,29191,null,0.37744510294268779,null,94400,null,76068,null,0.24099489930062576]
["Service de télé par satellite",null,-26026,null,-23142,null,-0.12462189957652753,null,-89252,null,-73538,null,-0.21368544154042807]
["Total d’abonnés des services de détail à la fin de la période (A) (B)",null,2751498,null,2735010.1380113,null,6.0284463883884419E-3,null,2751498,null,2735010.1380113,null,6.0284463883884419E-3]
["Services de télé IP (A) (B)",null,1988181,null,1882441.1380113999,null,5.6171669782091087E-2,null,1988181,null,1882441.1380113999,null,5.6171669782091087E-2]
["Service de télé par satellite",null,763317,null,852568.9999999,null,-0.1046859550369653,null,763317,null,852568.9999999,null,-0.1046859550369653]
["Services d’accès au réseau (SAR) résidentiels de détail (4)"]
["Pertes nettes d’abonnés des SAR résidentiels de détail",null,-37878,null,-40211,null,5.8018950038546666E-2,null,-175788,null,-185327,null,5.1471183367776958E-2]
["Abonnés des SAR résidentiels de détail (A) (B)",null,2190771,null,2298605,null,-4.6912801460015967E-2,null,2190771,null,2298605,null,-4.6912801460015967E-2]
[]
["n.s. : non significatif"]
["(A) ","Au T1 2022, à la suite de l’acquisition d’EBOX et d’autres sociétés liées, la clientèle des services Internet haute vitesse de détail a augmenté de 67 090 abonnés, celle des services de télé IP de détail, de 9 025 abonnés, et celle des SAR résidentiels de détail, de 3 456 abonnés."]
["(B)","Au T4 2022, à la suite de l’acquisition de Communications Distributel Limitée (« Distributel ») , notre clientèle d’abonnés des services Internet haute vitesse de détail a augmenté de 128 065 abonnés, celle des services de télé IP de détail, de 2 315 abonnés, et celle des SAR résidentiels de détail, de 64 498 abonnés."]

{"sheet":"Bell Wireline HIST p9","index":9,"n_rows":42,"n_cols":15,"rows_kept":42,"cut":false,"hidden":false,"merged":[[42,0,43,11],[33,0,33,1],[4,0,4,1],[41,1,41,14],[40,1,40,14]]}
[null,null,null,null,null,null,null,null,null,null,null,null,null,null,"Services sur fil de Bell – Tendance historique (2)"]
[]
[]
[]
["(en millions de dollars canadiens, sauf indication contraire) (non audité)",null,"TOTAL    \n2022     ",null,"T4 22","T3 22","T2 22","T1 22",null,"TOTAL     \n2021     ",null,"T4 21","T3 21","T2 21","T1 21"]
["Services sur fil de Bell"]
["Produits d’exploitation"]
["Services de données ",null,7920,null,2006,1987,1974,1953,null,7871,null,1986,1976,1944,1965]
["Tirés des services voix",null,3002,null,736,739,756,771,null,3154,null,779,778,794,803]
["Tirés d’autres services",null,309,null,77,77,78,77,null,289,null,75,73,67,74]
["Produits externes tirés des services",null,11231,null,2819,2803,2808,2801,null,11314,null,2840,2827,2805,2842]
["Produits intersectoriels tirés des services",null,412,null,105,104,101,102,null,358,null,94,93,86,85]
["Produits d’exploitation tirés des services",null,11643,null,2924,2907,2909,2903,null,11672,null,2934,2920,2891,2927]
["Services de données ",null,459,null,157,130,73,99,null,463,null,132,86,101,144]
["Équipements et autres",null,45,null,12,9,13,11,null,43,null,13,9,11,10]
["Produits externes tirés des produits",null,504,null,169,139,86,110,null,506,null,145,95,112,154]
["Produits intersectoriels tirés des produits",null,1,null,1,0,0,0,null,0,null,0,0,0,0]
["Produits d’exploitation tirés des produits",null,505,null,170,139,86,110,null,506,null,145,95,112,154]
["Total des produits externes",null,11735,null,2988,2942,2894,2911,null,11820,null,2985,2922,2917,2996]
["Total des produits d’exploitation",null,12148,null,3094,3046,2995,3013,null,12178,null,3079,3015,3003,3081]
["Coûts d’exploitation",null,-6831,null,-1776,-1729,-1680,-1646,null,-6863,null,-1753,-1682,-1710,-1718]
["BAIIA ajusté",null,5317,null,1318,1317,1315,1367,null,5315,null,1326,1333,1293,1363]
["Marge du BAIIA ajusté",null,0.438,null,0.42599999999999999,0.432,0.439,0.45400000000000001,null,0.436,null,0.43099999999999999,0.44212271973466005,0.43099999999999999,0.442]
[]
["Dépenses d’investissement ",null,3887,null,1251,1038,910,688,0,3612,0,1141,884,880,707]
["Intensité du capital ",null,0.3199703654922621,null,0.40433096315449257,0.34077478660538413,0.30383973288814692,0.22834384334550281,null,0.29660042699950728,null,0.37057486196817147,0.29320066334991707,0.29304029304029305,0.22947095098993833]
["Abonnés des services Internet haute vitesse de détail "]
["Activations nettes d’abonnés des services de détail",null,201762,null,63465.865849099995,89652,22619.999999999996,26024.134150900001,null,152285,null,47618,65779,17680,21208]
["Abonnés des services de détail à la fin de la période (A) (B)",null,4258570,null,4258570,4067038.85751,3977386.85751,3954766.85751,null,3861652.7233591001,null,3861652.7233591001,3814034.6467358,3748255.6467358,3730576]
["Abonnés des services de télé de détail"]
["Activations (pertes) nettes d’abonnés des services de détail",null,5148,null,14183,10853,-11527,-8361,null,2530,null,6049,10521,-4928,-9112]
["Services de télé IP ",null,94400,null,40209,38093,3838,12260,null,76068,null,29191,31641,4540,10696]
["Service de télé par satellite",null,-89252,null,-26026,-27240,-15365,-20621,null,-73538,null,-23142,-21120,-9468,-19808]
["Total d’abonnés des services de détail à la fin de la période (A) (B)",null,2751498,null,2751498,2734999.5638286001,2724147.1380113,2735674.1380113,null,2735010.1380113,null,2735010.1380113,2728961.1380113,2718440.1380113,2723368]
["Services de télé IP (A) (B)",null,1988181,null,1988181,1945656.5638287,1907564.1380113999,1903726.1380113999,null,1882441.1380113999,null,1882441.1380113999,1853250.1380113999,1821609.1380113999,1817069]
["Service de télé par satellite",null,763317,null,763317,789342.9999999,816582.9999999,831947.9999999,null,852568.9999999,null,852568.9999999,875710.9999999,896830.9999999,906299]
["Services d’accès au réseau (SAR) résidentiels de détail"]
["Pertes nettes d’abonnés des SAR résidentiels de détail",null,-175788,null,-37878,-42853,-52712,-42345,null,-185327,null,-40211,-42755,-51292,-51069]
["Abonnés des SAR résidentiels de détail (A) (B)",null,2190771,null,2190771,2164151,2207004,2259716,null,2298605,null,2298605,2338816.0000001001,2381571.0000001001,2432863]
[]
["(A)","Au T1 2022, à la suite de l’acquisition d’EBOX et d’autres sociétés liées, la clientèle des services Internet haute vitesse de détail a augmenté de 67 090 abonnés, celle des services de télé IP de détail, de 9 025 abonnés, et celle des SAR résidentiels de détail, de 3 456 abonnés."]
["(B)","Au T4 2022, à la suite de l’acquisition de Distributel, notre clientèle d’abonnés des services Internet haute vitesse de détail a augmenté de 128 065 abonnés, celle des services de télé IP de détail, de 2 315 abonnés, et celle des SAR résidentiels de détail, de 64 498 abonnés."]

{"sheet":"Net Debt & Bell other info p10","index":10,"n_rows":50,"n_cols":18,"rows_kept":50,"cut":false,"hidden":false,"merged":[[21,0,21,8],[1,5,1,8],[43,0,43,1],[30,0,30,1],[49,1,49,10]]}
[null,null,null,null,null,null,null,null,null,null,null,null,"BCE"]
[null,null,null,null,null,null,null,null,null,null,null,null,"Dette nette et autres renseignements (2)"]
[]
[]
["BCE – Dette nette et actions privilégiées"]
["(en millions de dollars canadiens, sauf indication contraire) (non audité)"]
[]
[null,null,null,null,null,null,null,"31 décembre","30 septembre","30 juin","31 mars","31 décembre"]
[null,null,null,null,null,null,null,2022,2022,2022,2022,2021]
[]
["Dette à long terme ",null,null,null,null,null,null,27783,26767,27007,26877,27048]
["Dette à court terme",null,null,null,null,null,null,4137,4686,3309,3082,2625]
["50 % des actions privilégiées",null,null,null,null,null,null,1935,1942.5,1943,1942.5,2001.5]
["Trésorerie",null,null,null,null,null,null,-99,-583,-596,-178,-289]
["Équivalents de trésorerie",null,null,null,null,null,null,-50,-150,0,0,0]
["Dette nette (A)",null,null,null,null,null,null,33706,32662.5,31663,31724,31386]
[]
["Ratio de levier financier net (A)",null,null,null,null,null,null,3.3,3.2,3.12,3.16,3.17]
["Ratio BAIIA ajusté/charges d’intérêts nettes ajustées (A)",null,null,null,null,null,null,8.5,8.9,9.01,8.94,8.77]
[]
[]
[]
[]
["Informations sur les flux de trésorerie "]
["(en millions de dollars canadiens, sauf indication contraire) (non audité)",null,null,null,"T4","T4","Variation","% de","TOTAL","TOTAL","Variation","% de"]
[null,null,null,null,2022,2021,"($)","variation",2022,2021,"($)","variation","variation"]
["Flux de trésorerie disponibles (A)"]
["Flux de trésorerie liés aux activités d’exploitation",null,null,null,2056,1743,313,0.17957544463568559,8365,8008,357,4.4580419580419584E-2,7.0231444533120514E-3]
["Dépenses d’investissement ",null,null,null,-1638,-1466,-172,-0.11732605729877217,-5133,-4852,-281,-5.7914262159934046E-2,-3.2191376255168339E-2]
["Dividendes en trésorerie payés sur actions privilégiées",null,null,null,-42,-32,-10,-0.3125,-136,-125,-11,-8.7999999999999995E-2,-1.0752688172043012E-2]
["Dividendes en trésorerie payés par des filiales aux détenteurs\n  de participations ne donnant pas le contrôle",null,null,null,-3,-45,42,0.93333333333333335,-39,-86,47,0.54651162790697672,0.12195121951219512]
["Coûts liés aux acquisitions et autres payés",null,null,null,3,29,-26,-0.89655172413793105,10,35,-25,-0.7142857142857143,0.16666666666666666]
["Flux de trésorerie disponibles",null,null,null,376,229,147,0.64192139737991272,3067,2980,87,2.919463087248322E-2,-2.1810250817884406E-2]
[]
[]
["Informations sur les flux de trésorerie – Tendance historique"]
[]
["(en millions de dollars canadiens, sauf indication contraire) (non audité)",null,"TOTAL","T4","T3","T2","T1","TOTAL","T4","T3","T2","T1"]
[null,null,2022,2022,2022,2022,2022,2021,2021,2021,2021,2021,2021]
["Flux de trésorerie disponibles"]
["Flux de trésorerie liés aux activités d’exploitation",null,8365,2056,1996,2597,1716,8008,1743,1774,2499,1992,1992]
["Dépenses d’investissement ",null,-5133,-1638,-1317,-1219,-959,-4852,-1466,-1164,-1210,-1012,-1012,null,null,null,null,"#"]
["Dividendes en trésorerie payés sur actions privilégiées",null,-136,-42,-27,-34,-33,-125,-32,-31,-31,-31,-31]
["Dividendes en trésorerie payés par des filiales aux détenteurs \n  de participations ne donnant pas le contrôle",null,-39,-3,-11,-14,-11,-86,-45,-13,-15,-13,-13]
["Coûts liés aux acquisitions et autres payés",null,10,3,1,3,3,35,29,0,2,4,4]
["Flux de trésorerie disponibles",null,3067,376,642,1333,716,2980,229,566,1245,940,940]
[]
[]
[]
["(A)","La dette nette et les flux de trésorerie disponibles sont des mesures financières non conformes aux PCGR, et le ratio de levier financier net et le ratio BAIIA ajusté/charges d’intérêts ajustées sont des mesures de gestion du capital. Voir la note 3.1 Mesures financières non conformes aux PCGR et la note 3.4 Mesures de gestion du capital dans les notes annexes du présent rapport pour en savoir plus sur ces mesures. "]

{"sheet":"BCE Inc. BS p11","index":11,"n_rows":64,"n_cols":10,"rows_kept":64,"cut":false,"hidden":false,"merged":[]}
[]
[]
[]
[]
[null,null,null,null,null,null,null,null,null,"  BCE"]
[null,null,null,null,null,null,null,null,null,"États consolidés de la situation financière (2)"]
[]
[null,"31 décembre",null,"30 septembre",null,"30 juin",null,"31 mars",null,"31 décembre"]
["(en millions de dollars canadiens, sauf indication contraire) (non audité)",2022,null,2022,null,2022,null,2022,null,2021]
["ACTIF"]
["Actifs courants"]
["Trésorerie ",99,null,583,null,596,null,178,null,289]
["Équivalents de trésorerie",50,null,150,null,0,null,0,null,0]
["Créances clients et autres débiteurs",4138,null,3819,null,3584,null,3549,null,3949]
["Stocks",656,null,627,null,565,null,567,null,482]
["Actifs sur contrats",436,null,383,null,373,null,386,null,414]
["Coûts des contrats",540,null,613,null,594,null,564,null,507]
["Charges payées d’avance",244,null,295,null,364,null,375,null,254]
["Autres actifs courants",324,null,367,null,226,null,197,null,253]
["Actifs détenus en vue de la vente",0,null,0,null,0,null,0,null,50]
["Total des actifs courants",6487,null,6837,null,6302,null,5816,null,6198]
["Actifs non courants   "]
["Actifs sur contrats",288,null,247,null,237,null,247,null,251]
["Coûts des contrats",603,null,431,null,366,null,365,null,387]
["Immobilisations corporelles",29256,null,28473,null,28157,null,28108,null,28235]
["Immobilisations incorporelles",16183,null,16163,null,15950,null,15825,null,15570]
["Actifs d’impôt différé",84,null,98,null,107,null,108,null,105]
["Participations dans des entreprises associées et des coentreprises",608,null,615,null,633,null,654,null,668]
["Actifs au titre des avantages postérieurs à l’emploi",3559,null,3678,null,4247,null,4110,null,3472]
["Autres actifs non courants",1355,null,1318,null,1307,null,1378,null,1306]
["Goodwill",10906,null,10700,null,10724,null,10724,null,10572]
["Total des actifs non courants",62842,null,61723,null,61728,null,61519,null,60566]
["Total de l’actif",69329,null,68560,null,68030,null,67335,null,66764]
["PASSIF "]
["Passifs courants"]
["Dettes fournisseurs et autres passifs",5220.5523965790235,null,4601.7387770427231,null,4248.3279816077229,null,3841.4259057270219,null,4455.1267429804611]
["Passifs sur contrats",857,null,801,null,785,null,838,null,799]
["Intérêts à payer",281,null,194,null,253,null,162,null,247]
["Dividendes à payer",867,null,867,null,855,null,854,null,811]
["Passifs d’impôt exigible",106,null,263,null,299,null,189,null,141]
["Dette à court terme",4137,null,4686,null,3309,null,3082,null,2625]
["Passifs détenus en vue de la vente",0,null,0,null,0,null,0,null,35]
["Total des passifs courants",11468.552396579023,null,11412.738777042723,null,9749.3279816077229,null,8966.425905727021,null,9113.1267429804611]
["Passifs non courants  "]
["Passifs sur contrats",228,null,227,null,239,null,244,null,246]
["Dette à long terme",27783,null,26767,null,27007,null,26877,null,27048]
["Passifs d’impôt différé",4953,null,4915,null,5120,null,5065,null,4679]
["Obligations au titre des avantages postérieurs à l’emploi",1311,null,1293,null,1266,null,1464,null,1734]
["Autres passifs non courants",1070,null,964,null,884,null,934,null,1003]
["Total des passifs non courants",35345,null,34166,null,34516,null,34584,null,34710]
["Total du passif",46814,null,45578.738777042723,null,44265.327981607727,null,43550.425905727025,null,43823.126742980457]
[" "]
["CAPITAUX PROPRES"]
["Capitaux propres attribuables aux actionnaires de BCE"]
["Actions privilégiées",3870,null,3885,null,3885,null,3885,null,4003]
["Actions ordinaires",20840,null,20838,null,20837,null,20830,null,20662]
["Surplus d’apport ",1172,null,1162,null,1151,null,1137,null,1157]
["Cumul des autres éléments de bénéfice global (de perte totale)",-55,null,10,null,273,null,355,null,213]
["Déficit ",-3649,null,-3254,null,-2709,null,-2740,null,-3400]
["Total des capitaux propres attribuables aux actionnaires de BCE",22178,null,22641,null,23437,null,23467,null,22635]
["Détenteurs de participations ne donnant pas le contrôle",337,null,340,null,328,null,318,null,306]
["Total des capitaux propres ",22515,null,22981,null,23765,null,23785,null,22941]
["Total du passif et des capitaux propres",69329,null,68560,null,68030.327981607727,null,67335.425905727025,null,66764.126742980457]
["Nombre d’actions ordinaires en circulation (en millions)",912,null,911.9,null,911.9,null,911.8,null,909]

{"sheet":"BCE Inc. CF Summary p12","index":12,"n_rows":51,"n_cols":12,"rows_kept":51,"cut":false,"hidden":false,"merged":[]}
[null,null,null,null,null,null,null,null,null,null,null,"BCE"]
[null,null,null,null,null,null,null,null,null,null,null,"Données consolidées sur les flux de trésorerie (2)"]
[]
[null,"T4",null,"T4",null,"Variation",null,"TOTAL",null,"TOTAL",null,"Variation"]
["(en millions de dollars canadiens, sauf indication contraire) (non audité)",2022,null,2021,null,"($)",null,2022,null,2021,null,"($)"]
[]
["Bénéfice net",567,null,658,null,-91,null,2926,null,2892,null,34]
["Ajustements de rapprochement du bénéfice net\n   et des flux de trésorerie liés aux activités d’exploitation"]
["Coûts liés aux indemnités de départ, aux acquisitions et autres",19,null,63,null,-44,null,94,null,209,null,-115]
["Amortissements ",1192,null,1176,null,16,null,4723,null,4609,null,114]
["Coût des régimes d’avantages postérieurs à l’emploi ",47,null,69,null,-22,null,198,null,286,null,-88]
["Charges d’intérêts nettes",319,null,269,null,50,null,1124,null,1063,null,61]
["Perte de valeur d’actifs",150,null,30,null,120,null,279,null,197,null,82]
["Pertes (profits) sur placements",29,null,6,null,23,null,-24,null,6,null,-30]
["Impôt sur le résultat",222,null,249,null,-27,null,967,null,1044,null,-77]
["Cotisations aux régimes d’avantages postérieurs à l’emploi",-12,null,-69,null,57,null,-140,null,-282,null,142]
["Paiements en vertu de régimes d’autres avantages postérieurs à l’emploi",-17,null,-18,null,1,null,-64,null,-65,null,1]
["Coûts liés aux indemnités de départ et autres payés",-27,null,-55,null,28,null,-129,null,-208,null,79]
["Intérêts payés",-243,null,-192,null,-51,null,-1197,null,-1080,null,-117]
["Impôt sur le résultat payé (après remboursements)",-340,null,-302,null,-38,null,-749,null,-913,null,164]
["Coûts liés aux acquisitions et autres payés",-3,null,-29,null,26,null,-10,null,-35,null,25]
["Variation des actifs sur contrats",-94,null,-21,null,-73,null,-59,null,278,null,-337]
["Variation des créances au titre des programmes de financement\n   d’appareils sans fil",-99,null,-121,null,22,null,22,null,-365,null,387]
["Variation nette des actifs et des passifs d’exploitation",346,null,30,null,316,null,404,null,372,null,32]
["Flux de trésorerie liés aux activités d’exploitation",2056,null,1743,null,313,null,8365,null,8008,null,357]
["Dépenses d’investissement",-1638,null,-1466,null,-172,null,-5133,null,-4852,null,-281]
["Dividendes en trésorerie payés sur actions privilégiées",-42,null,-32,null,-10,null,-136,null,-125,null,-11]
["Dividendes en trésorerie payés par des filiales aux détenteurs de participations ne donnant pas le contrôle",-3,null,-45,null,42,null,-39,null,-86,null,47]
["Coûts liés aux acquisitions et autres payés",3,null,29,null,-26,null,10,null,35,null,-25]
["Flux de trésorerie disponibles",376,null,229,null,147,null,3067,null,2980,null,87]
["Acquisitions d’entreprises",-287,null,0,null,-287,null,-429,null,-12,null,-417]
["Cessions d’entreprises",-1,null,0,null,-1,null,52,null,0,null,52]
["Coûts liés aux acquisitions et autres payés",-3,null,-29,null,26,null,-10,null,-35,null,25]
["Licences de spectre",0,null,-1664,null,1664,null,-3,null,-2082,null,2079]
["Autres activités d’investissement",-13,null,-23,null,10,null,-4,null,-72,null,68]
["(Diminution) augmentation des effets à payer",-511,null,719,null,-1230,null,111,null,351,null,-240]
["(Diminution) augmentation des créances titrisées",0,null,-130,null,130,null,700,null,-150,null,850]
["Émission de titres d’emprunt à long terme",1006,null,0,null,1006,null,1951,null,4985,null,-3034]
["Remboursement de titres d’emprunt à long terme",-250,null,-235,null,-15,null,-2023,null,-2751,null,728]
["Émission d’actions ordinaires",2,null,16,null,-14,null,171,null,261,null,-90]
["Achat d’actions pour le règlement de paiements fondés sur des actions",-49,null,-52,null,3,null,-255,null,-297,null,42]
["Rachat d’actions privilégiées",-10,null,0,null,-10,null,-125,null,0,null,-125]
["Dividendes en trésorerie payés sur actions ordinaires",-839,null,-795,null,-44,null,-3312,null,-3132,null,-180]
["Autres activités de financement",-5,null,-3,null,-2,null,-31,null,19,null,-50]
[null,-960,null,-2196,null,1236,null,-3207,null,-2915,null,-292]
["(Diminution) augmentation nette de la trésorerie",-484,null,-1886,null,1402,null,-190,null,65,null,-255]
["Trésorerie au début de la période",583,null,2175,null,-1592,null,289,null,224,null,65]
["Trésorerie à la fin de la période",99,null,289,null,-190,null,99,null,289,null,-190]
["(Diminution) augmentation nette des équivalents de trésorerie",-100,null,-81,null,-19,null,50,null,0,null,50]
["Équivalents de trésorerie au début de la période",150,null,81,null,69,null,0,null,0,null,0]
["Équivalents de trésorerie à la fin de la période",50,null,0,null,50,null,50,null,0,null,50]

{"sheet":"BCE Inc. CF HIST p13","index":13,"n_rows":51,"n_cols":14,"rows_kept":51,"cut":false,"hidden":false,"merged":[]}
[]
[null,null,null,null,null,null,null,null,null,null,null,null,null,"BCE"]
[null,null,null,null,null,null,null,null,null,null,null,null,null,"Données consolidées sur les flux de trésorerie – Tendance historique (2)"]
[]
["(en millions de dollars canadiens, sauf indication contraire) (non audité)","TOTAL\n2022",null,"T4 22","T3 22","T2 22","T1 22",null,"TOTAL\n2021",null,"T4 21","T3 21","T2 21","T1 21"]
[]
["Bénéfice net",2926,null,567,771,654,934,null,2892,null,658,813,734,687]
["Ajustements de rapprochement du bénéfice net \n   et des flux de trésorerie liés aux activités d’exploitation"]
["Coûts liés aux indemnités de départ, aux acquisitions et autres",94,null,19,22,40,13,null,209,null,63,50,7,89]
["Amortissements ",4723,null,1192,1181,1199,1151,null,4609,null,1176,1147,1153,1133]
["Coût des régimes d’avantages postérieurs à l’emploi",198,null,47,48,52,51,null,286,null,69,70,68,79]
["Charges d’intérêts nettes",1124,null,319,282,265,258,null,1063,null,269,268,263,263]
["Perte de valeur d’actifs",279,null,150,21,106,2,null,197,null,30,0,164,3]
["(Profits) pertes sur placements",-24,null,29,0,-16,-37,null,6,null,6,0,0,0]
["Impôt sur le résultat",967,null,222,178,232,335,null,1044,null,249,306,236,253]
["Cotisations aux régimes d’avantages postérieurs à l’emploi",-140,null,-12,-14,-35,-79,null,-282,null,-69,-64,-70,-79]
["Paiements en vertu de régimes d’autres avantages postérieurs à l’emploi",-64,null,-17,-17,-15,-15,null,-65,null,-18,-16,-16,-15]
["Coûts liés aux indemnités de départ et autres payés",-129,null,-27,-44,-30,-28,null,-208,null,-55,-31,-79,-43]
["Intérêts payés",-1197,null,-243,-385,-196,-373,null,-1080,null,-192,-352,-230,-306]
["Impôt sur le résultat payé (après remboursements)",-749,null,-340,-150,-143,-116,null,-913,null,-302,-407,-95,-109]
["Coûts liés aux acquisitions et autres payés",-10,null,-3,-1,-3,-3,null,-35,null,-29,0,-2,-4]
["Variation des actifs sur contrats",-59,null,-94,-20,23,32,null,278,null,-21,53,102,144]
["Variation des créances au titre des programmes de financement d’appareils sans fil",22,null,-99,-6,68,59,null,-365,null,-121,-92,-61,-91]
["Variation nette des actifs et des passifs d’exploitation",404,null,346,130,396,-468,null,372,null,30,29,325,-12]
["Flux de trésorerie liés aux activités d’exploitation",8365,null,2056,1996,2597,1716,null,8008,null,1743,1774,2499,1992]
["Dépenses d’investissement",-5133,null,-1638,-1317,-1219,-959,null,-4852,null,-1466,-1164,-1210,-1012]
["Dividendes en trésorerie payés sur actions privilégiées",-136,null,-42,-27,-34,-33,null,-125,null,-32,-31,-31,-31]
["Dividendes en trésorerie payés par des filiales aux détenteurs de participations \n   ne donnant pas le contrôle",-39,null,-3,-11,-14,-11,null,-86,null,-45,-13,-15,-13]
["Coûts liés aux acquisitions et autres payés",10,null,3,1,3,3,null,35,null,29,0,2,4]
["Flux de trésorerie disponibles ",3067,null,376,642,1333,716,null,2980,null,229,566,1245,940]
["Acquisitions d’entreprises",-429,null,-287,-3,0,-139,null,-12,null,0,-1,-11,0]
["Cessions d’entreprises",52,null,-1,-1,2,52,null,0,null,0,0,0,0]
["Coûts liés aux acquisitions et autres payés",-10,null,-3,-1,-3,-3,null,-35,null,-29,0,-2,-4]
["Licences de spectre",-3,null,0,-3,0,0,null,-2082,null,-1664,-418,0,0]
["Autres activités d’investissement",-4,null,-13,-8,27,-10,null,-72,null,-23,-11,-17,-21]
["Augmentation (diminution) des effets à payer",111,null,-511,-34,187,469,null,351,null,719,-322,311,-357]
["Augmentation (diminution) des créances titrisées",700,null,0,700,0,0,null,-150,null,-130,-7,0,-13]
["Émission de titres d’emprunt à long terme",1951,null,1006,0,0,945,null,4985,null,0,1570,500,2915]
["Remboursement de titres d’emprunt à long terme",-2023,null,-250,-270,-245,-1258,null,-2751,null,-235,-249,-2041,-226]
["Émission d’actions ordinaires",171,null,2,1,7,161,null,261,null,16,172,63,10]
["Achat d’actions pour le règlement de paiements fondés sur des actions",-255,null,-49,-49,-51,-106,null,-297,null,-52,-83,-71,-91]
["Rachat d’actions privilégiées",-125,null,-10,0,0,-115,null,0,null,0,0,0,0]
["Dividendes en trésorerie payés sur actions ordinaires",-3312,null,-839,-839,-839,-795,null,-3132,null,-795,-793,-791,-753]
["Autres activités de financement",-31,null,-5,2,0,-28,null,19,null,-3,-14,-44,80]
[null,-3207,null,-960,-505,-915,-827,null,-2915,null,-2196,-156,-2103,1540]
["(Diminution) augmentation nette de la trésorerie",-190,null,-484,-13,418,-111,null,65,null,-1886,329,-158,1780]
["Trésorerie au début de la période",289,null,583,596,178,289,null,224,null,2175,1846,2004,224]
["Trésorerie à la fin de la période",99,null,99,583,596,178,null,289,null,289,2175,1846,2004]
["Augmentation (diminution) nette des équivalents de trésorerie",50,null,-100,150,0,0,null,0,0,-81,81,-700,700]
["Équivalents de trésorerie au début de la période",0,null,150,0,0,0,null,0,null,81,0,700,0]
["Équivalents de trésorerie à la fin de la période",50,null,50,150,0,0,null,0,null,0,81,0,700]

{"sheet":"Accomp Notes p14","index":14,"n_rows":0,"n_cols":0,"rows_kept":0,"cut":false,"hidden":false,"merged":[]}

{"sheet":"Accomp Notes p15","index":15,"n_rows":0,"n_cols":0,"rows_kept":0,"cut":false,"hidden":false,"merged":[]}

{"sheet":"Accomp Notes p16","index":16,"n_rows":0,"n_cols":0,"rows_kept":0,"cut":false,"hidden":false,"merged":[]}

{"sheet":"Accomp Notes p17","index":17,"n_rows":0,"n_cols":0,"rows_kept":0,"cut":false,"hidden":false,"merged":[]}

{"sheet":"Accomp Notes p18","index":18,"n_rows":0,"n_cols":0,"rows_kept":0,"cut":false,"hidden":false,"merged":[]}

{"sheet":"Accomp Notes p19","index":19,"n_rows":0,"n_cols":0,"rows_kept":0,"cut":false,"hidden":false,"merged":[]}

{"sheet":"Accomp Notes p20","index":20,"n_rows":0,"n_cols":0,"rows_kept":0,"cut":false,"hidden":false,"merged":[]}

{"sheet":"Accomp Notes p21","index":21,"n_rows":0,"n_cols":0,"rows_kept":0,"cut":false,"hidden":false,"merged":[]}

{"sheet":"Cover Page - Appendix A","index":22,"n_rows":39,"n_cols":11,"rows_kept":39,"cut":false,"hidden":false,"merged":[]}
[]
[]
[]
[]
[]
[]
[]
[]
[]
[]
[]
[]
[]
[]
[]
[]
[]
[]
[]
[null,null,"T4"]
[]
[]
[]
[]
[]
[]
[]
[]
[]
[]
[]
[]
[]
[]
[null," ",null,null," ",null," "]
[]
[]
[]
[null,null,null,null,null,null,null,null,null,null," "]

{"sheet":"Segmented Reporting Changes p23","index":23,"n_rows":0,"n_cols":0,"rows_kept":0,"cut":false,"hidden":false,"merged":[]}

{"sheet":"BCE Inc. Seg Info HIST p24","index":24,"n_rows":34,"n_cols":14,"rows_kept":34,"cut":false,"hidden":false,"merged":[[33,0,33,12]]}
[null,null,null,null,null,null,null,null,null,null,null,null,null,"BCE"]
[null,null,null,null,null,null,null,null,null,null,null,null,null,"Retraité - Données sectorielles - Tendance historique"]
[]
["(en millions de dollars canadiens, sauf indication contraire) (non audité)","TOTAL\n2022 ",null,"T4 22 ","T3 22","T2 22","T1 22",null,"TOTAL\n2021",null,"T4 21","T3 21","T2 21","T1 21"]
[]
["Produits d’exploitation"]
["Bell SCT (A)",21301,null,5649,5401,5135,5116,null,20797,null,5454,5213,5039,5091]
["Bell Média",3254,null,889,719,821,825,null,3036,null,849,719,755,713]
["Éliminations intersectorielles(A)",-381,null,-99,-96,-95,-91,null,-384,null,-94,-96,-96,-98]
["Au total ",24174,null,6439,6024,5861,5850,null,23449,null,6209,5836,5698,5706]
[]
["Coûts d’exploitation"]
["Bell SCT (A)",-11847,null,-3341,-2995,-2771,-2740,null,-11629,null,-3177,-2870,-2777,-2805]
["Bell Média",-2509,null,-760,-537,-595,-617,null,-2311,null,-696,-504,-541,-570]
["Éliminations intersectorielles (A)",381,null,99,96,95,91,null,384,null,94,96,96,98]
["Au total ",-13975,null,-4002,-3436,-3271,-3266,null,-13556,null,-3779,-3278,-3222,-3277]
[]
["BAIIA ajusté"]
["Bell SCT (A)",9454,null,2308,2406,2364,2376,null,9168,null,2277,2343,2262,2286]
["Marge (A)",0.44382892821933245,null,0.40856788812179146,0.44547306054434366,0.46037000973709835,0.46442533229085226,null,0.44083281242486899,null,0.41749174917491749,0.44945328985229233,0.44889859099027585,0.44902769593400116]
["Bell Média",745,null,129,182,226,208,null,725,null,153,215,214,143]
["Marge",0.22894898586355256,null,0.14510686164229472,0.25312934631432543,0.27500000000000002,0.252,null,0.23899999999999999,null,0.18,0.29902642559109877,0.28299999999999997,0.20100000000000001]
["Au total ",10199,null,2437,2588,2590,2584,null,9893,null,2430,2558,2476,2429]
["Marge",0.42189956151236868,null,0.37847491846560027,0.42961487383798141,0.442,0.442,null,0.42199999999999999,null,0.39100000000000001,0.43831391363947908,0.435,0.42599999999999999]
[]
["Dépenses d’investissement"]
["Bell SCT",4971,null,1559,1286,1190,936,null,4732,null,1414,1139,1186,993]
["Intensité du capital (A)",0.2333693253837848,null,0.27597804921224994,0.23810405480466582,0.2317429406037001,0.18295543393275998,null,0.2275328172332548,null,0.25925925925925924,0.21849223096105888,0.23536415955546736,0.19505008839127871]
["Bell Média",162,null,79,31,29,23,null,120,null,52,25,24,19]
["Intensité du capital",4.9784880147510757E-2,null,8.8863892013498313E-2,4.3115438108484005E-2,3.5322777101096221E-2,2.8000000000000001E-2,null,3.9525691699604744E-2,null,6.1248527679623084E-2,3.4770514603616132E-2,3.1788079470198675E-2,2.6647966339410939E-2]
["Au total",5133,null,1638,1317,1219,959,null,4852,null,1466,1164,1210,1012]
["Intensité du capital",0.21233556713824769,null,0.25438732722472435,0.21862549800796813,0.20799999999999999,0.16400000000000001,null,0.20691713932363853,null,0.23610887421484941,0.19859492803289924,0.21182871182871182,0.17735716789344549]
[]
["(A) Les produits d’exploitation de Bell SCT, les éliminations intersectorielles des produits d’exploitation, les coûts d’exploitation de Bell SCT, les éliminations intersectorielles des coûts d’exploitation et le BAIIA ajusté de Bell SCT sont des mesures financières non conformes aux PCGR, et la marge du BAIIA ajusté de Bell SCT et l’intensité du capital de Bell SCT sont des ratios non conformes aux PCGR. Se reporter à la note 1, Mesures financières non conformes aux PCGR, et à la note 2, Ratios non conformes aux PCGR, de la section Mesures non conformes aux PCGR et autres mesures financières de la présente annexe pour plus de détails sur ces mesures."]

{"sheet":"Non-GAAP p25","index":25,"n_rows":0,"n_cols":0,"rows_kept":0,"cut":false,"hidden":false,"merged":[]}

{"sheet":"Non-GAAP p26","index":26,"n_rows":0,"n_cols":0,"rows_kept":0,"cut":false,"hidden":false,"merged":[]}

{"sheet":"Non-GAAP p27","index":27,"n_rows":0,"n_cols":0,"rows_kept":0,"cut":false,"hidden":false,"merged":[]}

{"sheet":"Non-GAAP p28","index":28,"n_rows":0,"n_cols":0,"rows_kept":0,"cut":false,"hidden":false,"merged":[]}

{"sheet":"Non-GAAP p29","index":29,"n_rows":0,"n_cols":0,"rows_kept":0,"cut":false,"hidden":false,"merged":[]}

{"sheet":"Non-GAAP p30","index":30,"n_rows":0,"n_cols":0,"rows_kept":0,"cut":false,"hidden":false,"merged":[]}

{"sheet":"Non-GAAP p31","index":31,"n_rows":0,"n_cols":0,"rows_kept":0,"cut":false,"hidden":false,"merged":[]}