{"text_format":"1","workbook":"xlsx","n_sheets":27,"sheets":["Conso Validation","Cover Page ","BCE Inc. IS Summary p2","EPMFormattingSheet","BCE Inc. IS HIST p3","BCE Inc Seg Info Summary p4","BCE Inc. Seg Info HIS p5","BCE Inc. Seg Info HIST p5","CTS HIST p6FMO-delete","CTS Summary p6","CTS HIST Info p7","CTS Metrics Summary p8","BCE Inc. Seg Info Summary p4","Bell Wireless Summary p6","Bell Wireless HIST p7","Bell Wireline Summary p8","Bell Wireline HIST p9","CTS HIST Info p9","Net Debt & Bell other info p10","BCE Inc. BS p11","BCE Inc. CF Summary p12","BCE Inc. CF HIST p13","Accomp Notes p14","Accomp Notes p15","Accomp Notes p16","Accomp Notes p17","Accomp Notes p18"],"not_rendered":{"charts":0,"images":26,"macros":0,"external_links":0,"defined_names":251,"comments":0,"pivot_tables":0},"unopened":[],"bounds":{"document_bytes":16777216,"sheet_cells":100000,"rows_first":2000,"rows_last":500,"rows_between":2000,"halvings":0,"cell_chars":16384,"cell_head_chars":4096},"cells_cut":0,"cells_raw":0,"read":"whole","date_system":"1900"}

{"sheet":"Conso Validation","index":0,"n_rows":8,"n_cols":1,"rows_kept":8,"cut":false,"hidden":true,"merged":[]}
[]
[]
[]
[]
[]
[]
[]
[{"$f":"IF(_xll.EPMRetrieveData(,\"CONSOLIDATED\")=0,\"CONSOLIDATED\",\"IMPACTED\")","v":{"$error":"#NAME?"}}]

{"sheet":"Cover Page ","index":1,"n_rows":30,"n_cols":3,"rows_kept":30,"cut":false,"hidden":false,"merged":[]}
[]
[]
[]
[]
[]
[]
[]
[]
[]
[]
[]
[]
[]
[]
[]
[]
[]
[]
[]
[null,null,"T2 "]
[]
[]
[]
[]
[]
[]
[null,null,"Relations avec les investisseurs, BCE"]
[null,null,"Richard Bengian"]
[null,null,"514-786-8219"]
[null,null,"richard.bengian@bell.ca"]

{"sheet":"BCE Inc. IS Summary p2","index":2,"n_rows":53,"n_cols":13,"rows_kept":53,"cut":false,"hidden":false,"merged":[[51,1,51,12],[41,0,41,1],[52,1,52,12]]}
[null,null,null,null,null,null,null,null,null,null,null,null,"BCE (1)"]
[null,null,null,null,null,null,null,null,null,null,null,null,"Données opérationnelles consolidées"]
[]
[]
[null,null,"T2","T2",null,"Variation","% de",null,"Cumul","Cumul",null,"Variation","% de"]
[" (en millions de dollars canadiens, sauf les montants liés aux actions) (non audité)",null,"2025","2024",null,"($)","variation",null,2025,2024,null,"($)","variation"]
["Produits d’exploitation"]
["  Tirés des services ",null,5267,5308,null,-41,-7.7241899020346651E-3,null,10439,10500,null,-61,-5.8095238095238096E-3]
["  Tirés des produits",null,818,697,null,121,0.17360114777618366,null,1576,1516,null,60,3.9577836411609502E-2]
["Total des produits d’exploitation",null,6085,6005,null,80,1.3322231473771857E-2,null,12015,12016,null,-1,0]
["Coûts d’exploitation",null,-3411,-3308,null,-103,-3.1136638452237003E-2,null,-6783,-6754,null,-29,-4.293751850755108E-3]
["BAIIA ajusté (A)",null,2674,2697,null,-23,-8.5279940674823883E-3,null,5232,5262,null,-30,-5.7012542759407071E-3]
["Marge du BAIIA ajusté (B)(3)",null,"43,9  %",0.4491257285595337,null,null,-1,null,"43,5  %",0.438,null,null,-0.30000000000000027]
["Coûts liés aux indemnités de départ, aux acquisitions et autres",null,-41,-22,null,-19,-0.86363636363636365,null,-288,-251,null,-37,-0.14741035856573706]
["Amortissement des immobilisations corporelles",null,-949,-945,null,-4,-4.2328042328042331E-3,null,-1890,-1891,null,1,5.2882072977260709E-4]
["Amortissement des immobilisations incorporelles",null,-338,-325,null,-13,-0.04,null,-669,-641,null,-28,-4.3681747269890797E-2]
["Charges financières"]
["  Charges d’intérêts",null,-442,-426,null,-16,-3.7558685446009391E-2,null,-865,-842,null,-23,-2.7315914489311165E-2]
["  Rendements nets au titre des régimes d’avantages postérieurs à l’emploi",null,26,17,null,9,0.52941176470588236,null,51,33,null,18,0.54545454545454541]
["Perte de valeur d’actifs",null,-8,-60,null,52,0.8666666666666667,null,-17,-73,null,56,0.76712328767123283]
["Autres (charges) produits",null,-38,-101,null,63,0.62376237623762376,null,270,-139,null,409,"n.s."]
["Impôt sur le résultat",null,-240,-231,null,-9,-3.896103896103896E-2,null,-497,-397,null,-100,-0.25188916876574308]
["Bénéfice net",null,644,604,null,40,6.6225165562913912E-2,null,1327,1061,null,266,0.25070688030160226]
[]
["Bénéfice net attribuable aux :"]
["  Actionnaires ordinaires",null,579,537,null,42,7.8212290502793297E-2,null,1209,939,null,270,0.28753993610223644]
["  Actionnaires privilégiés",null,40,46,null,-6,-0.13043478260869565,null,81,93,null,-12,-0.12903225806451613]
["  Détenteurs de participations ne donnant pas le contrôle ",null,25,21,null,4,0.19047619047619047,null,37,29,null,8,0.27586206896551724]
["Bénéfice net",null,644,604,null,40,6.6225165562913912E-2,null,1327,1061,null,266,0.25070688030160226]
[]
["Bénéfice net par action ordinaire – de base et dilué",null,0.63197873026103768,0.59,null,4.0000000000000036E-2,6.7796610169491595E-2,null,1.3061797752808988,1.03,0,0.28000000000000003,0.2718446601941748]
[]
["Dividendes par action ordinaire",null,0.4375,0.99750000000000005,null,-0.56000000000000005,-0.56140350877192979,null,1.4350000000000001,1.9950000000000001,null,-0.56000000000000005,-0.2807017543859649]
["Nombre moyen pondéré d’actions ordinaires en circulation – de base (en millions)",null,930.9,912.3,null,null,null,null,925.6,912.3]
["Nombre moyen pondéré d’actions ordinaires en circulation – dilué (en millions)",null,930.9,912.3,null,null,null,null,925.6,912.3]
["Nombre d’actions ordinaires en circulation (en millions)",null,932.5,912.3,null,null,null,null,932.5,912.3]
[]
["Bénéfice net ajusté et BPA ajusté"]
["Bénéfice net attribuable aux actionnaires ordinaires",null,579,537,null,42,7.8212290502793297E-2,null,1209,939,null,270,0.28753993610223644]
["Éléments de rapprochement :"]
["  Coûts liés aux indemnités de départ, aux acquisitions et autres",null,41,22,null,19,0.86363636363636365,null,288,251,null,37,0.14741035856573706]
["  Pertes nettes liées à la valeur de marché sur dérivés utilisés à titre de \n       couverture économique des régimes de rémunération fondée sur des actions qui  \n       sont réglés en instruments de capitaux propres",null,43,23,null,20,0.86956521739130432,null,42,113,null,-71,-0.62831858407079644]
["  Pertes nettes sur participations mises en équivalence dans des entreprises associées et des coentreprises",null,0,93,null,-93,-1,null,0,93,null,-93,-1]
["  Pertes nettes sur placements",null,8,2,null,6,"n.s.",null,10,8,null,2,0.25]
["  Profits liés au remboursement anticipé de titres d'emprunt",null,-91,0,null,-91,"n.s.",null,-357,0,null,-357,"n.s."]
["  Perte de valeur d’actifs",null,8,60,null,-52,-0.8666666666666667,null,17,73,null,-56,-0.76712328767123283]
["  Impôt lié aux éléments de rapprochement ci-dessus",null,4,-25,null,29,"n.s.",null,16,-110,null,126,"n.s."]
["  Participations ne donnant pas le contrôle liées aux éléments de rapprochement ci-dessus",null,0,0,null,0,"n.s.",null,0,-1,null,1,1]
["Bénéfice net ajusté (A)",null,592,712,null,-120,-0.16853932584269662,null,1225,1366,null,-141,-0.10322108345534407]
["BPA ajusté (A)",null,0.6256466705879512,0.77731447988600255,null,-0.15000000000000002,-0.19197209029477794,null,1.3234658599827138,1.5,null,-0.17999999999999994,-0.11999999999999995]
[" n.s. : non significatif"]
[" (A) ","Le BAIIA ajusté représente un total des mesures sectorielles, le bénéfice net ajusté est une mesure financière non conforme aux PCGR et le BPA ajusté est un ratio non conforme aux PCGR. Voir la note 2.3 Total des mesures sectorielles, la note 2.1 Mesures financières non conformes aux PCGR et la note 2.2 Ratios non conformes aux PCGR dans les notes annexes du présent rapport pour en savoir plus sur ces mesures."]
[" (B) ","La marge du BAIIA ajusté est définie comme le BAIIA ajusté divisé par les produits d’exploitation."]

{"sheet":"EPMFormattingSheet","index":3,"n_rows":125,"n_cols":26,"rows_kept":125,"cut":false,"hidden":true,"merged":[[36,2,37,2],[29,4,29,6],[27,1,47,1],[36,3,37,3],[0,1,0,11],[4,1,4,11],[5,1,5,11],[9,2,11,2],[12,2,14,2],[61,2,63,2],[54,4,54,6],[8,4,8,6],[8,8,8,10],[6,1,26,1],[15,3,16,3],[54,8,54,10],[53,1,73,1],[55,2,57,2],[58,2,60,2],[15,2,16,2],[29,8,29,10],[51,1,51,11],[52,1,52,11],[30,2,32,2],[33,2,35,2],[76,2,78,2],[75,8,75,10],[74,1,94,1],[64,2,66,2],[85,2,87,2],[88,2,90,2],[75,4,75,6],[67,2,69,2],[70,2,71,2],[91,2,92,2],[118,1,126,1],[121,7,121,11],[109,2,111,2],[112,2,114,2],[108,4,108,6],[108,8,108,10],[107,1,114,1],[117,1,117,11],[6,14,18,14],[21,14,28,14],[32,14,38,14],[120,2,122,2],[123,2,124,2],[119,4,119,6],[119,7,119,11],[97,1,97,11],[98,1,98,11],[101,2,103,2],[104,2,106,2],[100,4,100,6],[100,8,100,10],[99,1,106,1],[79,2,81,2],[82,2,84,2]]}
[null,"EPM Formatting Sheet",null,null,null,null,null,null,null,null,null,null,null,null,null,null,null,null,null,null,null,null,null,null,1,false]
[]
[null,"Note: The format settings in lower sections overrides the ones in upper section if there are conflicts."]
[]
[null,"Hierarchy Level Formatting",null,null,null,null,null,null,null,null,null,null,null,null,"Help"]
[null,null,null,null,null,null,null,null,null,null,null,null,null,null,"Formatting and \"Use\" Column:"]
[null,"Row",null,null,null,null,null,null,null,null,null,null,null,null,"In the \"1000\" and \"Label\" cells, define the format you want by using the standard Microsoft Office Excel cell formatting functions.\r\nBy default, all the format settings are applied and \"ALL\" is displayed in the \"Use\" column.\r\n\r\nYou can then specify which settings of the defined format you want to apply or define additional settings.To do so, double-click in a \"Use\" cell and define the format settings in the dialog box that opens, or directly enter the format settings in a \"Use\" cell, using a specific syntax, for example: (FontBold = Y) | (FontSize = 18).\r\n\t\t"]
[]
[null,null,null,null,"Data",null,null,"Use","Header",null,null,"Use"]
[]
[null,null,null,"Default Format",null,10000,null,"All",null,"Label",null,"All"]
[]
[]
[null,null,null,"Base Level Format",null,10000,null,"All",null,"Label",null,"All"]
[]
[null,null,null,"Formatting on Specific Level:"]
[]
[null,null,null,{"$f":"IF(Y1=2, \"Level 1\", IF(Z1=TRUE, IF(A26-1=0, \"Lowest Level\",\"Lowest Level -\"&(A26-1)), \"Level 1\"))","v":"Level 1"},null,10000,null,"All",null,"Label",null,"All"]
[]
[]
[null,null,null,{"$f":"IF(Y1=2, \"Level 2\", IF(Z1=TRUE, IF(A26-2=0, \"Lowest Level\",\"Lowest Level -\"&(A26-2)), \"Level 2\"))","v":"Level 2"},null,10000,null,"All",null,"Label",null,"All",null,null,"Priority to Row or Column"]
[null,null,null,null,null,null,null,null,null,null,null,null,null,null,"These options enable you to specify which one of the defined formats for rows or for columns will be applied first in case of conflicts. When you click the \"Priority to Column\" option, the \"Column\" section is displayed first in the formatting section and the \"Row\" section is displayed in second position in the formatting section and the precedence rules apply."]
[]
[null,null,null,{"$f":"IF(Y1=2, \"Level 3\", IF(Z1=TRUE, IF(A26-3=0, \"Lowest Level\",\"Lowest Level -\"&(A26-3)), \"Level 3\"))","v":"Level 3"},null,10000,null,"All",null,"Label",null,"All"]
[]
[3]
[]
[null,"Column"]
[]
[null,null,null,null,"Data",null,null,"Use","Header",null,null,"Use"]
[]
[null,null,null,"Default Format",null,10000,null,"All",null,"Label",null,"All",null,null,"Inner or Outer Dimension:"]
[null,null,null,null,null,null,null,null,null,null,null,null,null,null,"If a row or column axis contains more than one dimension, you can specify which dimension you want the defined format to be applied to; \"Inner dimension\" being the last dimension, Outer dimension\" being the first dimension in the axis."]
[]
[null,null,null,"Base Level Format",null,10000,null,"All",null,"Label",null,"All"]
[]
[null,null,null,"Formatting on Specific Level:"]
[]
[null,null,null,{"$f":"IF(Y1=2, \"Level 1\", IF(Z1=TRUE, IF(A47-1=0, \"Lowest Level\",\"Lowest Level -\"&(A47-1)), \"Level 1\"))","v":"Level 1"},null,10000,null,"All",null,"Label",null,"All"]
[]
[]
[null,null,null,{"$f":"IF(Y1=2, \"Level 2\", IF(Z1=TRUE, IF(A47-2=0, \"Lowest Level\",\"Lowest Level -\"&(A47-2)), \"Level 2\"))","v":"Level 2"},null,10000,null,"All",null,"Label",null,"All"]
[]
[]
[null,null,null,{"$f":"IF(Y1=2, \"Level 3\", IF(Z1=TRUE, IF(A47-3=0, \"Lowest Level\",\"Lowest Level -\"&(A47-3)), \"Level 3\"))","v":"Level 3"},null,10000,null,"All",null,"Label",null,"All"]
[]
[3]
[]
[]
[]
[]
[null,"Dimension Member/Property Formatting"]
[]
[null,"Row"]
[null,null,null,null,"Data",null,null,"Use","Header",null,null,"Use"]
[]
[null,null,null,"Custom Member Default Format",null,10000,null,"All",null,"Label",null,"All"]
[]
[]
[null,null,null,"Calculated Member Default Format",null,10000,null,"All",null,"Label",null,"All"]
[]
[]
[null,null,null,"Inputable Member Default Format",null,10000,null,"All",null,"Label",null,"All"]
[]
[]
[null,null,null,"Local Member Default Format",null,10000,null,"All",null,"Label",null,"All"]
[]
[]
[null,null,null,"Changed Member Default Format",null,10000,null,"All",null,"Label",null,"All"]
[]
[]
[null,null,null,"Formatting on Specific Member/Property:"]
[]
[]
[null,"Column"]
[null,null,null,null,"Data",null,null,"Use","Header",null,null,"Use"]
[]
[null,null,null,"Custom Member Default Format",null,10000,null,"All",null,"Label",null,"All"]
[]
[]
[null,null,null,"Calculated Member Default Format",null,10000,null,"All",null,"Label",null,"All"]
[]
[]
[null,null,null,"Inputable Member Default Format",null,10000,null,"All",null,"Label",null,"All"]
[]
[]
[null,null,null,"Local Member Default Format",null,10000,null,"All",null,"Label",null,"All"]
[]
[]
[null,null,null,"Changed Member Default Format",null,10000,null,"All",null,"Label",null,"All"]
[]
[]
[null,null,null,"Formatting on Specific Member/Property:"]
[]
[]
[]
[]
[null,"Row and Column Banding"]
[]
[null,"Row"]
[null,null,null,null,"Data",null,null,"Use","Header",null,null,"Use"]
[]
[null,null,null,"Odd Formatting",null,10000,null,"All",null,"Label",null,"All"]
[]
[]
[null,null,null,"Even Formatting",null,10000,null,"All",null,"Label",null,"All"]
[]
[null,"Column"]
[null,null,null,null,"Data",null,null,"Use","Header",null,null,"Use"]
[]
[null,null,null,"Odd Formatting",null,10000,null,"All",null,"Label",null,"All"]
[]
[]
[null,null,null,"Even Formatting",null,10000,null,"All",null,"Label",null,"All"]
[]
[]
[]
[null,"Page Axis Formatting"]
[]
[null,null,null,null,"Header",null,null,"Use"]
[]
[null,null,null,"Default Format",null,"Label",null,"All"]
[]
[]
[null,null,null,"Formatting on Specific Dimension:"]

{"sheet":"BCE Inc. IS HIST p3","index":4,"n_rows":50,"n_cols":12,"rows_kept":50,"cut":false,"hidden":false,"merged":[]}
[null,null,null,null,null,null,null,null,null,null,null,"BCE"]
[null,null,null,null,null,null,null,null,null,null,null,"Données opérationnelles consolidées – Tendance historique"]
[]
[]
[null,"Cumul",null,null,null,null,"TOTAL"]
["(en millions de dollars canadiens, sauf les montants liés aux actions) (non audité)","2025",null,"T2 25","T1 25",null,"2024",null,"T4 24","T3 24","T2 24","T1 24"]
["Produits d’exploitation"]
["   Tirés des services ",10439,null,5267,5172,null,21073,null,5287,5286,5308,5192]
["   Tirés des produits",1576,null,818,758,null,3336,null,1135,685,697,819]
["Total des produits d’exploitation",12015,null,6085,5930,null,24409,null,6422,5971,6005,6011]
["Coûts d’exploitation",-6783,null,-3411,-3372,null,-13820,null,-3817,-3249,-3308,-3446]
["BAIIA ajusté ",5232,null,2674,2558,null,10589,null,2605,2722,2697,2565]
["Marge du BAIIA ajusté ",0.43545568039950061,null,0.43944124897288417,0.43136593591905564,null,0.43381539596050639,null,0.4056368732482093,0.45587003851951097,0.4491257285595337,0.42699999999999999]
["Coûts liés aux indemnités de départ, aux acquisitions et autres",-288,null,-41,-247,null,-454,null,-154,-49,-22,-229]
["Amortissement des immobilisations corporelles",-1890,null,-949,-941,null,-3758,null,-933,-934,-945,-946]
["Amortissement des immobilisations incorporelles",-669,null,-338,-331,null,-1283,null,-317,-325,-325,-316]
["Charges financières"]
["   Charges d’intérêts",-865,null,-442,-423,null,-1713,null,-431,-440,-426,-416]
["   Rendements nets au titre des régimes d’avantages postérieurs à l’emploi",51,null,26,25,null,66,null,17,16,17,16]
["Perte de valeur d’actifs",-17,null,-8,-9,null,-2190,null,-4,-2113,-60,-13]
["Autres produits (charges)",270,null,-38,308,null,-305,null,-103,-63,-101,-38]
["Impôt sur le résultat",-497,null,-240,-257,null,-577,null,-175,-5,-231,-166]
["Bénéfice net (perte nette)",1327,null,644,683,null,375,null,505,-1191,604,457]
[]
["Bénéfice net (perte nette) attribuable aux :"]
["   Actionnaires ordinaires",1209,null,579,630,null,163,null,461,-1237,537,402]
["   Actionnaires privilégiés",81,null,40,41,null,181,null,43,45,46,47]
["   Détenteurs de participations ne donnant pas le contrôle",37,null,25,12,null,31,null,1,1,21,8]
["Bénéfice net (perte nette)",1327,null,644,683,null,375,null,505,-1191,604,457]
[]
["Bénéfice net (perte nette) par action ordinaire – de base et dilué",1.3061797752808988,null,0.63197873026103768,0.68455938280995332,null,0.17866929738024773,null,0.50531623369505629,-1.3566469363148086,0.59,0.44]
["Dividendes par action ordinaire",1.4350000000000001,null,0.4375,0.99750000000000005,null,3.99,null,0.99753000000000003,0.99750000000000005,0.99750000000000005,0.99750000000000005]
[]
["Nombre moyen pondéré d’actions ordinaires en circulation – de base (en millions)",925.6,null,930.9,920.3,null,912.3,null,912.3,912.3,912.3,912.3]
["Nombre moyen pondéré d’actions ordinaires en circulation – dilué (en millions)",925.6,null,930.9,920.3,null,912.3,null,912.3,912.3,912.3,912.3]
["Nombre d’actions ordinaires en circulation (en millions)",932.5,null,932.5,921.8,null,912.3,null,912.3,912.3,912.3,912.3]
[]
["Bénéfice net ajusté et BPA ajusté"]
["Bénéfice net (perte nette) attribuable aux actionnaires ordinaires",1209,null,579,630,null,163,null,461,-1237,537,402]
["   Éléments de rapprochement :"]
["   Coûts liés aux indemnités de départ, aux acquisitions et autres",288,null,41,247,null,454,null,154,49,22,229]
["   Pertes nettes (profits nets) lié(e)s à la valeur de marché sur dérivés utilisés à titre \n     de couverture économique des régimes de rémunération fondée sur des actions \n     qui sont réglés en instruments de capitaux propres",42,null,43,-1,null,269,null,198,-42,23,90]
["   Pertes nettes sur participations mises en équivalence dans \n     des entreprises associées et des coentreprises",0,null,0,0,null,247,null,0,154,93,0]
["   Pertes nettes (profits nets) sur placements",10,null,8,2,null,-57,null,1,-66,2,6]
["   Profits liés au remboursement anticipé de titres d'emprunt",-357,null,-91,-266,null,0,null,0,0,0,0]
["   Perte de valeur d’actifs",17,null,8,9,null,2190,null,4,2113,60,13]
["   Impôt lié aux éléments de rapprochement ci-dessus",16,null,4,12,null,-467,null,-99,-258,-25,-85]
["   Participations ne donnant pas le contrôle liées aux éléments de rapprochement ci-dessus",0,null,0,0,null,-26,null,0,-25,0,-1]
["Bénéfice net ajusté ",1225,null,592,633,null,2773,null,719,688,712,654]
["BPA ajusté",1.3234658599827138,null,0.6256466705879512,0.68781918939476261,null,3.0395703167817607,null,0.78811794365888477,0.75413789323687364,0.77731447988600255,0.72]

{"sheet":"BCE Inc Seg Info Summary p4","index":5,"n_rows":35,"n_cols":12,"rows_kept":35,"cut":false,"hidden":false,"merged":[[34,0,34,11]]}
[null,null,null,null,null,null,null,null,null,null,null,"BCE"]
[null,null,null,null,null,null,null,null,null,null,null,"Informations sectorielles"]
[]
[null,"T2","T2",null,"Variation","% de",null,"Cumul","Cumul",null,"Variation","% de"]
["(en millions de dollars canadiens, sauf indication contraire) (non audité)","2025","2024",null,"($)","variation",null,2025,2024,null,"($)","variation"]
[]
["Produits d’exploitation"]
["   Bell Services de communications et de technologies (Bell SCT)",5334,5283,null,51,9.6536059057353782E-3,null,10580,10658,null,-78,-7.3184462375680244E-3]
["   Bell Média",843,812,null,31,3.8177339901477834E-2,null,1618,1537,null,81,5.2700065061808715E-2]
["     Éliminations intersectorielles",-92,-90,null,-2,-2.2222222222222223E-2,null,-183,-179,null,-4,-2.23463687150838E-2]
["Au total",6085,6005,null,80,1.3322231473771857E-2,null,12015,12016,null,-1,0]
[]
["Coûts d’exploitation"]
["   Bell SCT",-2895,-2804,null,-91,-3.2453637660485021E-2,null,-5742,-5731,null,-11,-1.9193857965451055E-3]
["   Bell Média",-608,-594,null,-14,-2.3569023569023569E-2,null,-1224,-1202,null,-22,-1.8302828618968387E-2]
["     Éliminations intersectorielles",92,90,null,2,2.2222222222222223E-2,null,183,179,null,4,2.23463687150838E-2]
["Au total",-3411,-3308,null,-103,-3.1136638452237003E-2,null,-6783,-6754,null,-29,-4.293751850755108E-3]
[]
["BAIIA ajusté"]
["   Bell SCT",2439,2479,null,-40,-1.6135538523598225E-2,null,4838,4927,null,-89,-1.8063730464785873E-2]
["     Marge","45,7  %",0.46899999999999997,null,null,-1.1999999999999955,null,"45,7  %",0.46200000000000002,null,null,-0.50000000000000044]
["   Bell Média",235,218,null,17,7.7981651376146793E-2,null,394,335,null,59,0.17611940298507461]
["     Marge","27,9  %",0.26800000000000002,null,null,1.100000000000001,null,"24,4  %",0.218,null,null,2.5999999999999996]
["   Au total",2674,2697,null,-23,-8.5279940674823883E-3,null,5232,5262,null,-30,-5.7012542759407071E-3]
["     Marge","43,9  %",0.44900000000000001,null,null,-1.0000000000000009,null,"43,5  %",0.438,null,null,-0.30000000000000027]
[]
["Dépenses d’investissement"]
["   Bell SCT",727,945,null,218,0.23068783068783069,null,1431,1920,null,489,0.25468750000000001]
["     Intensité du capital (A)(3)","13,6  %",0.17887563884156729,null,null,4.299999999999998,null,"13,5  %",0.18,null,null,4.4999999999999982]
["   Bell Média",36,33,null,-3,-9.0909090909090912E-2,null,61,60,null,-1,-1.6666666666666666E-2]
["     Intensité du capital ","4,3  %",4.064039408866995E-2,null,null,-0.19999999999999948,null,"3,8  %",3.9E-2,null,null,0.10000000000000009]
["Au total",763,978,null,215,0.21983640081799591,null,1492,1980,null,488,0.24646464646464647]
["     Intensité du capital ","12,5  %",0.16286427976686094,null,null,3.8000000000000007,null,"12,4  %",0.16500000000000001,null,null,4.1000000000000005]
[]
["(A) L’intensité du capital correspond aux dépenses d’investissement divisées par les produits d’exploitation. "]

{"sheet":"BCE Inc. Seg Info HIS p5","index":6,"n_rows":33,"n_cols":12,"rows_kept":33,"cut":false,"hidden":false,"merged":[]}
[null,null,null,null,null,null,null,null,null,null,null,"BCE"]
[null,null,null,null,null,null,null,null,null,null,null,"Informations sectorielles – Tendance historique"]
[]
[null,"Cumul",null,null,null,null,"TOTAL"]
["(en millions de dollars canadiens, sauf indication contraire) (non audité)","2025",null,"T2 25","T1 25",null,"2024",null,"T4 24","T3 24","T2 24","T1 24"]
[]
["Produits d’exploitation"]
["Bell SCT",10580,null,5334,5246,null,21619,null,5681,5280,5283,5375]
["Bell Média",1618,null,843,775,null,3151,null,832,782,812,725]
["Éliminations intersectorielles",-183,null,-92,-91,null,-361,null,-91,-91,-90,-89]
["Au total ",12015,null,6085,5930,null,24409,null,6422,5971,6005,6011]
[]
["Coûts d’exploitation"]
["Bell SCT",-5742,null,-2895,-2847,null,-11788,null,-3245,-2812,-2804,-2927]
["Bell Média",-1224,null,-608,-616,null,-2393,null,-663,-528,-594,-608]
["Éliminations intersectorielles",183,null,92,91,null,361,null,91,91,90,89]
["Au total ",-6783,null,-3411,-3372,null,-13820,null,-3817,-3249,-3308,-3446]
[]
["BAIIA ajusté"]
["Bell SCT",4838,null,2439,2399,null,9831,null,2436,2468,2479,2448]
["Marge",0.45700000000000002,null,0.45700000000000002,0.45700000000000002,null,0.45500000000000002,null,0.42899999999999999,0.46700000000000003,0.46899999999999997,0.45500000000000002]
["Bell Média",394,null,235,159,null,758,null,169,254,218,117]
["Marge",0.24399999999999999,null,0.27900000000000003,0.20499999999999999,null,0.24099999999999999,null,0.20300000000000001,0.32500000000000001,0.26800000000000002,0.161]
["Au total ",5232,null,2674,2558,null,10589,null,2605,2722,2697,2565]
["Marge",0.435,null,0.439,0.43099999999999999,null,0.434,null,0.40600000000000003,0.45600000000000002,0.44900000000000001,0.42699999999999999]
[]
["Dépenses d’investissement"]
["Bell SCT",1431,null,727,704,null,3746,null,907,919,945,975]
["Intensité du capital",0.13525519848771267,null,0.13629546306711662,0.13400000000000001,null,0.17327350941301634,null,0.15965499031860589,0.17405303030303029,0.17887563884156729,0.18099999999999999]
["Bell Média",61,null,36,25,null,151,null,56,35,33,27]
["Intensité du capital",3.7700865265760199E-2,null,4.2704626334519574E-2,3.2000000000000001E-2,null,4.7921294827039038E-2,null,6.7307692307692304E-2,4.4757033248081841E-2,4.064039408866995E-2,3.6999999999999998E-2]
["Au total",1492,null,763,729,null,3897,null,963,954,978,1002]
["Intensité du capital",0.12417811069496462,null,0.12539030402629417,0.123,null,0.15965422590028269,null,0.14995328558081594,0.15977223245687489,0.16286427976686094,0.16700000000000001]

{"sheet":"BCE Inc. Seg Info HIST p5","index":7,"n_rows":63,"n_cols":20,"rows_kept":63,"cut":false,"hidden":true,"merged":[]}
["CORPORATE","CONSOL"]
["ACTUAL","ACTUAL"]
["ALL_DS","ALL_DS","All Data Sources"]
["All Posting Levels","BCE_CONS - BCE"]
["Canadian Dollar","F_CLO - Closing Balance"]
["All Trading Partners","BCE - BCE Consolidated."]
["Year To Date","ALL_POSTING - All posting levels (C)"]
["Quarter to date","CAD - Canadian Dollar"]
[null,"All Trading Partners"]
[null,"YTD - Year To Date"]
[]
[]
[]
[]
[null,null,null,null,"2022.Q4 - 2022.Q4",null,"2021.Q4 - 2021.Q4"]
[null,null,"Revenues"]
[null,null,null,null,null,null,null,null,null,null,null,null,null,null,null,null,"BCE (2)"]
[null,null,null,null,null,null,null,null,null,null,null,null,null,null,null,null,"Segmented Data - Historical Trend"]
[]
[null,null,null,"(In millions of Canadian dollars, except where otherwise indicated) (unaudited)","TOTAL\n2022",null,"Q4 22","Q3 22","Q2 22","Q1 22",null,"TOTAL\n2021",null,"Q4 21","Q3 21","Q2 21","Q1 21",null,"CY Check","PY Check"]
[]
[null,null,null,"Operating revenues"]
[null,"T401000 - Total Revenue","WRLESS","Bell Wireless",{"$f":"ROUND(_xll.EPMRetrieveData($A$1,$B$23,$A$2,$A$3,$A$4,$A$5,E15,$A$6,$A$7,$C$23)/1000000,0)","v":{"$error":"#NAME?"}},null,{"$f":"E23-H23-I23-J23","v":{"$error":"#NAME?"}},2466,2246,2210,null,8999,null,2475,2296,2128,2100,null,{"$f":"SUM(G23:J23)=E23","v":{"$error":"#NAME?"}},{"$f":"SUM(N23:Q23)=L23","v":true}]
[null,null,"WRLINE","Bell Wireline",{"$f":"(ROUND(_xll.EPMRetrieveData($A$1,$B$23,$A$2,$C$24,$A$3,$A$4,$A$5,E15,$A$6,$A$7)/1000000,0))-1","v":{"$error":"#NAME?"}},null,{"$f":"E24-H24-I24-J24","v":{"$error":"#NAME?"}},3046,2995,3013,null,12178,null,3079,3015,3003,3081,null,{"$f":"SUM(G24:J24)=E24","v":{"$error":"#NAME?"}},{"$f":"SUM(N24:Q24)=L24","v":true}]
[null,null,"Bell_Media","Bell Media",{"$f":"ROUND(_xll.EPMRetrieveData($A$1,$B$23,$A$2,$C$25,$A$3,$A$4,$A$5,E15,$A$6,$A$7)/1000000,0)","v":{"$error":"#NAME?"}},null,{"$f":"E25-H25-I25-J25","v":{"$error":"#NAME?"}},719,821,825,null,3036,null,849,719,755,713,null,{"$error":"#NAME?"},true]
[null,null,null,"Inter-segment eliminations",{"$f":"E27-E23-E24-E25","v":{"$error":"#NAME?"}},null,{"$f":"E26-H26-I26-J26","v":{"$error":"#NAME?"}},-207,-201,-198,null,-764,null,-194,-194,-188,-188,null,{"$error":"#NAME?"},true]
[null,null,"BELL","Total ",{"$f":"ROUND(_xll.EPMRetrieveData($A$1,$B$23,$A$2,$C$27,$A$3,$A$4,$A$5,E15,$A$6,$A$7)/1000000,0)","v":{"$error":"#NAME?"}},null,{"$f":"E27-H27-I27-J27","v":{"$error":"#NAME?"}},6024,5861,5850,null,23449,null,6209,5836,5698,5706,null,{"$error":"#NAME?"},true]
[]
[null,null,null,"Operating costs"]
[null,null,null,"Bell Wireless",{"$f":"(E37-E23)","v":{"$error":"#NAME?"}},null,{"$f":"E30-H30-I30-J30","v":{"$error":"#NAME?"}},-1377,-1197,-1201,null,-5146,null,-1524,-1286,-1159,-1177,null,{"$error":"#NAME?"},true]
[null,null,null,"Bell Wireline",{"$f":"E39-E24","v":{"$error":"#NAME?"}},null,{"$f":"E31-H31-I31-J31","v":{"$error":"#NAME?"}},-1729,-1680,-1646,null,-6863,null,-1753,-1682,-1710,-1718,null,{"$error":"#NAME?"},true]
[null,null,null,"Bell Media",{"$f":"E41-E25","v":{"$error":"#NAME?"}},null,{"$f":"E32-H32-I32-J32","v":{"$error":"#NAME?"}},-537,-595,-617,null,-2311,null,-696,-504,-541,-570,null,{"$error":"#NAME?"},true]
[null,null,null,"Inter-segment eliminations",{"$f":"-E26","v":{"$error":"#NAME?"}},null,{"$f":"E33-H33-I33-J33","v":{"$error":"#NAME?"}},207,201,198,null,764,null,194,194,188,188,null,{"$error":"#NAME?"},true]
[null,null,null,"Total ",{"$f":"E43-E27","v":{"$error":"#NAME?"}},null,{"$f":"E34-H34-I34-J34","v":{"$error":"#NAME?"}},-3436,-3271,-3266,null,-13556,null,-3779,-3278,-3222,-3277,null,{"$error":"#NAME?"},true]
[]
[null,null,null,"Adjusted EBITDA"]
[null,"T6CCCCA - EBITDA",null,"Bell Wireless",{"$f":"ROUND(_xll.EPMRetrieveData($A$1,$B$37,$A$2,$C$23,$A$3,$A$4,$A$5,E15,$A$6,$A$7)/1000000,0)","v":{"$error":"#NAME?"}},null,{"$f":"E37-H37-I37-J37","v":{"$error":"#NAME?"}},1089,1049,1009,null,3853,null,951,1010,969,923,null,{"$f":"SUM(G37:J37)=E37","v":{"$error":"#NAME?"}},{"$f":"SUM(N37:Q37)=L37","v":true}]
[null,null,null,"Margin",{"$f":"ROUND(E37/E23,3)","v":{"$error":"#NAME?"}},null,{"$f":"ROUND(G37/G23,3)","v":{"$error":"#NAME?"}},0.442,0.46700000000000003,0.45700000000000002,null,0.42799999999999999,null,0.38400000000000001,0.43989547038327526,0.45500000000000002,0.44]
[null,null,null,"Bell Wireline",{"$f":"ROUND(_xll.EPMRetrieveData($A$1,$B$37,$A$2,$C$24,$A$3,$A$4,$A$5,E15,$A$6,$A$7)/1000000,0)","v":{"$error":"#NAME?"}},null,{"$f":"E39-H39-I39-J39","v":{"$error":"#NAME?"}},1317,1315,1367,null,5315,null,1326,1333,1293,1363,null,{"$f":"SUM(G39:J39)=E39","v":{"$error":"#NAME?"}},true]
[null,null,null,"Margin",{"$f":"ROUND(E39/E24,3)","v":{"$error":"#NAME?"}},null,{"$f":"ROUND(G39/G24,3)","v":{"$error":"#NAME?"}},0.432,0.439,0.45400000000000001,null,0.436,null,0.43099999999999999,0.44212271973466005,0.43099999999999999,0.442]
[null,null,null,"Bell Media",{"$f":"ROUND(_xll.EPMRetrieveData($A$1,$B$37,$A$2,$C$25,$A$3,$A$4,$A$5,E15,$A$6,$A$7)/1000000,0)","v":{"$error":"#NAME?"}},null,{"$f":"E41-H41-I41-J41","v":{"$error":"#NAME?"}},182,226,208,null,725,null,153,215,214,143,null,{"$error":"#NAME?"},true]
[null,null,null,"Margin",{"$f":"ROUND(E41/E25,3)","v":{"$error":"#NAME?"}},null,{"$f":"ROUND(G41/G25,3)","v":{"$error":"#NAME?"}},0.253,0.27500000000000002,0.252,null,0.23899999999999999,null,0.18,0.29902642559109877,0.28299999999999997,0.20100000000000001]
[null,null,null,"Total ",{"$f":"ROUND(_xll.EPMRetrieveData($A$1,$B$37,$A$2,$C$27,$A$3,$A$4,$A$5,E15,$A$6,$A$7)/1000000,0)","v":{"$error":"#NAME?"}},null,{"$f":"E43-H43-I43-J43","v":{"$error":"#NAME?"}},2588,2590,2584,null,9893,null,2430,2558,2476,2429,null,{"$error":"#NAME?"},true]
[null,null,null,"Margin",{"$f":"ROUND(E43/E27,3)","v":{"$error":"#NAME?"}},null,{"$f":"ROUND(G43/G27,3)","v":{"$error":"#NAME?"}},0.43,0.442,0.442,null,0.42199999999999999,null,0.39100000000000001,0.43831391363947908,0.435,0.42599999999999999]
[]
[null,null,null,"Capital expenditures"]
[null,"TCFCapEx",null,"Bell Wireless",1084,null,{"$f":"E47-H47-I47-J47","v":308},248,280,248,null,{"$f":"SUM(N47:Q47)","v":1120},null,273,255,306,286,null,{"$f":"SUM(G47:J47)=E47","v":true},true]
[null,null,null,"Capital intensity",{"$f":"E47/E23","v":{"$error":"#NAME?"}},null,{"$f":"G47/G23","v":{"$error":"#NAME?"}},0.10056772100567721,0.1246660730186999,{"$f":"J47/J23","v":0.11221719457013575},{"$error":"#DIV/0!"},0.12445827314146016,{"$error":"#DIV/0!"},0.11030303030303031,0.11106271777003485,0.14379699248120301,{"$f":"Q47/Q23","v":0.1361904761904762}]
[null,null,null,"Bell Wireline",3887,null,{"$f":"E49-H49-I49-J49","v":1251},1038,910,688,null,{"$f":"SUM(N49:Q49)","v":3612},null,1141,884,880,707,null,true,true]
[null,null,null,"Capital intensity",{"$f":"E49/E24","v":{"$error":"#NAME?"}},null,{"$f":"G49/G24","v":{"$error":"#NAME?"}},0.34077478660538413,0.30383973288814692,{"$f":"J49/J24","v":0.22834384334550281},{"$error":"#DIV/0!"},{"$f":"L49/L24","v":0.29660042699950728},{"$error":"#DIV/0!"},0.37057486196817147,0.29320066334991707,{"$f":"P49/P24","v":0.29304029304029305},0.22947095098993833]
[null,null,"SAPCO_2300_CONS - Bell Media","Bell Media",162,null,{"$f":"E51-H51-I51-J51","v":79},31,29,23,null,120,null,52,25,24,19,null,true,true]
[null,null,null,"Capital intensity",{"$f":"E51/E25","v":{"$error":"#NAME?"}},null,{"$f":"G51/G25","v":{"$error":"#NAME?"}},4.3115438108484005E-2,3.5322777101096221E-2,{"$f":"J51/J25","v":2.7878787878787878E-2},{"$error":"#DIV/0!"},3.9525691699604744E-2,{"$error":"#DIV/0!"},6.1248527679623084E-2,3.4770514603616132E-2,{"$f":"P51/P25","v":3.1788079470198675E-2},2.6647966339410939E-2]
[null,null,"BCE_CONS - BCE","Total",{"$f":"-ROUND(_xll.EPMRetrieveData($B$1,$B$47,$B$2,$C$53,$B$3,$B$4,$B$5,E15,$B$7,$B$8,$B$9,$B$10)/1000000,0)","v":{"$error":"#NAME?"}},null,{"$f":"E53-H53-I53-J53","v":{"$error":"#NAME?"}},1317,1219,{"$f":"J47+J49+J51","v":959},{"$f":"K47+K49+K51","v":0},4852,0,1466,1164,1210,{"$f":"Q47+Q49+Q51","v":1012},null,{"$error":"#NAME?"},true]
[null,null,null,"Capital intensity",{"$f":"E53/E27","v":{"$error":"#NAME?"}},null,{"$f":"G53/G27","v":{"$error":"#NAME?"}},0.21862549800796813,0.20798498549735539,{"$f":"J53/J27","v":0.16393162393162394},{"$error":"#DIV/0!"},{"$f":"L53/L27","v":0.20691713932363853},{"$error":"#DIV/0!"},0.23610887421484941,{"$f":"O53/O27","v":0.19945167923235094},{"$f":"P53/P27","v":0.21235521235521235},{"$f":"Q53/Q27","v":0.17735716789344549}]
[]
[]
[]
[]
[]
[null,null,null,null,{"$f":"E47+E49+E51=E53","v":{"$error":"#NAME?"}},true,{"$error":"#NAME?"},true,true,true,true,true,true,true,true,true,{"$f":"Q47+Q49+Q51=Q53","v":true}]
[null,null,null,null,{"$f":"E37+E39+E41=E43","v":{"$error":"#NAME?"}},{"$f":"F37+F39+F41=F43","v":true},{"$error":"#NAME?"},true,true,true,true,true,true,true,true,true,true]
[null,null,null,null,{"$f":"E30+E31+E32+E33=E34","v":{"$error":"#NAME?"}},{"$f":"F30+F31+F32+F33=F34","v":true},{"$error":"#NAME?"},true,true,true,true,true,true,{"$f":"N30+N31+N32+N33=N34","v":true},true,true,true]
[null,null,null,null,{"$f":"E23+E24+E25+E26=E27","v":{"$error":"#NAME?"}},{"$f":"F23+F24+F25+F26=F27","v":true},{"$error":"#NAME?"},true,true,true,true,true,true,true,true,true,true]

{"sheet":"CTS HIST p6FMO-delete","index":8,"n_rows":44,"n_cols":13,"rows_kept":44,"cut":false,"hidden":true,"merged":[[41,0,41,11],[42,1,42,12],[43,1,44,12]]}
[]
[null,null,null,null,null,null,null,null,null,null,null,null,"Bell Wireline (1) (2)"]
[]
[]
[null,null,"Q4",null,"Q4",null,null,null,"TOTAL",null,"TOTAL"]
["(In millions of Canadian dollars, except where otherwise indicated) (unaudited)",null,2022,null,2021,null,"% change",null,2022,null,2021,null,"% change"]
["Bell Wireline"]
["Operating revenues"]
["Data ",null,{"$f":"'Bell Wireline HIST p9'!G24","v":{"$error":"#NAME?"}},null,{"$f":"'Bell Wireline HIST p9'!N24","v":1986},null,{"$f":"IF(OR(((ABS(C9-E9)/E9))>100%,((ABS(C9-E9)/E9))<-100%),\"n.m.\",((C9-E9)/ABS(E9)))","v":{"$error":"#NAME?"}},{"$f":"(C9-F9)/F9","v":{"$error":"#NAME?"}},{"$f":"'Bell Wireline HIST p9'!E24","v":{"$error":"#NAME?"}},null,{"$f":"'Bell Wireline HIST p9'!O24+'Bell Wireline HIST p9'!P24+'Bell Wireline HIST p9'!Q24+'Bell Wireline HIST p9'!N24","v":7871},null,{"$f":"IF(OR(((ABS(I9-K9)/K9))>100%,((ABS(I9-K9)/K9))<-100%),\"n.m.\",((I9-K9)/ABS(K9)))","v":{"$error":"#NAME?"}}]
["Voice",null,{"$f":"'Bell Wireline HIST p9'!G25","v":{"$error":"#NAME?"}},null,{"$f":"'Bell Wireline HIST p9'!N25","v":779},null,{"$f":"IF(OR(((ABS(C10-E10)/E10))>100%,((ABS(C10-E10)/E10))<-100%),\"n.m.\",((C10-E10)/ABS(E10)))","v":{"$error":"#NAME?"}},{"$error":"#NAME?"},{"$f":"'Bell Wireline HIST p9'!E25","v":{"$error":"#NAME?"}},null,{"$f":"'Bell Wireline HIST p9'!O25+'Bell Wireline HIST p9'!P25+'Bell Wireline HIST p9'!Q25+'Bell Wireline HIST p9'!N25","v":3154},null,{"$f":"IF(OR(((ABS(I10-K10)/K10))>100%,((ABS(I10-K10)/K10))<-100%),\"n.m.\",((I10-K10)/ABS(K10)))","v":{"$error":"#NAME?"}}]
["Other services",null,{"$f":"'Bell Wireline HIST p9'!G26","v":{"$error":"#NAME?"}},null,{"$f":"'Bell Wireline HIST p9'!N26","v":75},null,{"$f":"IF(OR(((ABS(C11-E11)/E11))>100%,((ABS(C11-E11)/E11))<-100%),\"n.m.\",((C11-E11)/ABS(E11)))","v":{"$error":"#NAME?"}},{"$error":"#NAME?"},{"$f":"'Bell Wireline HIST p9'!E26","v":{"$error":"#NAME?"}},null,{"$f":"'Bell Wireline HIST p9'!O26+'Bell Wireline HIST p9'!P26+'Bell Wireline HIST p9'!Q26+'Bell Wireline HIST p9'!N26","v":289},null,{"$f":"IF(OR(((ABS(I11-K11)/K11))>100%,((ABS(I11-K11)/K11))<-100%),\"n.m.\",((I11-K11)/ABS(K11)))","v":{"$error":"#NAME?"}}]
["External service revenues",null,{"$f":"'Bell Wireline HIST p9'!G27","v":{"$error":"#NAME?"}},null,{"$f":"'Bell Wireline HIST p9'!N27","v":2840},null,{"$f":"IF(OR(((ABS(C12-E12)/E12))>100%,((ABS(C12-E12)/E12))<-100%),\"n.m.\",((C12-E12)/ABS(E12)))","v":{"$error":"#NAME?"}},{"$error":"#NAME?"},{"$f":"'Bell Wireline HIST p9'!E27","v":{"$error":"#NAME?"}},null,{"$f":"'Bell Wireline HIST p9'!O27+'Bell Wireline HIST p9'!P27+'Bell Wireline HIST p9'!Q27+'Bell Wireline HIST p9'!N27","v":11314},null,{"$f":"IF(OR(((ABS(I12-K12)/K12))>100%,((ABS(I12-K12)/K12))<-100%),\"n.m.\",((I12-K12)/ABS(K12)))","v":{"$error":"#NAME?"}}]
["Inter-segment service revenues",null,{"$f":"'Bell Wireline HIST p9'!G28","v":{"$error":"#NAME?"}},null,{"$f":"'Bell Wireline HIST p9'!N28","v":94},null,{"$f":"IF(OR(((ABS(C13-E13)/E13))>=100%,((ABS(C13-E13)/E13))<=-100%),\"n.m.\",((C13-E13)/ABS(E13)))","v":{"$error":"#NAME?"}},{"$error":"#NAME?"},{"$f":"'Bell Wireline HIST p9'!E28","v":{"$error":"#NAME?"}},null,{"$f":"'Bell Wireline HIST p9'!O28+'Bell Wireline HIST p9'!P28+'Bell Wireline HIST p9'!Q28+'Bell Wireline HIST p9'!N28","v":358},null,{"$f":"IF(OR(((ABS(I13-K13)/K13))>=100%,((ABS(I13-K13)/K13))<=-100%),\"n.m.\",((I13-K13)/ABS(K13)))","v":{"$error":"#NAME?"}}]
["Operating service revenues",null,{"$f":"'Bell Wireline HIST p9'!G29","v":{"$error":"#NAME?"}},null,{"$f":"'Bell Wireline HIST p9'!N29","v":2934},null,{"$f":"IF(OR(((ABS(C14-E14)/E14))>100%,((ABS(C14-E14)/E14))<-100%),\"n.m.\",((C14-E14)/ABS(E14)))","v":{"$error":"#NAME?"}},{"$error":"#NAME?"},{"$f":"'Bell Wireline HIST p9'!E29","v":{"$error":"#NAME?"}},null,{"$f":"'Bell Wireline HIST p9'!O29+'Bell Wireline HIST p9'!P29+'Bell Wireline HIST p9'!Q29+'Bell Wireline HIST p9'!N29","v":11672},null,{"$f":"IF(OR(((ABS(I14-K14)/K14))>100%,((ABS(I14-K14)/K14))<-100%),\"n.m.\",((I14-K14)/ABS(K14)))","v":{"$error":"#NAME?"}}]
["Data ",null,{"$f":"'Bell Wireline HIST p9'!G30","v":{"$error":"#NAME?"}},null,{"$f":"'Bell Wireline HIST p9'!N30","v":132},null,{"$f":"IF(OR(((ABS(C15-E15)/E15))>100%,((ABS(C15-E15)/E15))<-100%),\"n.m.\",((C15-E15)/ABS(E15)))","v":{"$error":"#NAME?"}},{"$error":"#NAME?"},{"$f":"'Bell Wireline HIST p9'!E30","v":{"$error":"#NAME?"}},null,{"$f":"'Bell Wireline HIST p9'!O30+'Bell Wireline HIST p9'!P30+'Bell Wireline HIST p9'!Q30+'Bell Wireline HIST p9'!N30","v":463},null,{"$error":"#NAME?"}]
["Equipment and other",null,{"$f":"'Bell Wireline HIST p9'!G31","v":{"$error":"#NAME?"}},null,{"$f":"'Bell Wireline HIST p9'!N31","v":13},null,{"$error":"#NAME?"},{"$error":"#NAME?"},{"$f":"'Bell Wireline HIST p9'!E31","v":{"$error":"#NAME?"}},null,{"$f":"'Bell Wireline HIST p9'!O31+'Bell Wireline HIST p9'!P31+'Bell Wireline HIST p9'!Q31+'Bell Wireline HIST p9'!N31","v":43},null,{"$error":"#NAME?"}]
["External product revenues",null,{"$f":"'Bell Wireline HIST p9'!G32","v":{"$error":"#NAME?"}},null,{"$f":"'Bell Wireline HIST p9'!N32","v":145},null,{"$error":"#NAME?"},{"$error":"#NAME?"},{"$f":"'Bell Wireline HIST p9'!E32","v":{"$error":"#NAME?"}},null,{"$f":"'Bell Wireline HIST p9'!O32+'Bell Wireline HIST p9'!P32+'Bell Wireline HIST p9'!Q32+'Bell Wireline HIST p9'!N32","v":506},null,{"$error":"#NAME?"}]
["Inter-segment product revenues",null,{"$f":"'Bell Wireline HIST p9'!G33","v":{"$error":"#NAME?"}},null,{"$f":"'Bell Wireline HIST p9'!N33","v":0},null,"n.m",0,{"$f":"'Bell Wireline HIST p9'!E33","v":{"$error":"#NAME?"}},null,{"$f":"'Bell Wireline HIST p9'!O33+'Bell Wireline HIST p9'!P33+'Bell Wireline HIST p9'!Q33+'Bell Wireline HIST p9'!N33","v":0},null,"n.m"]
["Operating product revenues",null,{"$f":"'Bell Wireline HIST p9'!G34","v":{"$error":"#NAME?"}},null,{"$f":"'Bell Wireline HIST p9'!N34","v":145},null,{"$error":"#NAME?"},{"$f":"(C19-F19)/F19","v":{"$error":"#NAME?"}},{"$f":"'Bell Wireline HIST p9'!E34","v":{"$error":"#NAME?"}},null,{"$f":"'Bell Wireline HIST p9'!O34+'Bell Wireline HIST p9'!P34+'Bell Wireline HIST p9'!Q34+'Bell Wireline HIST p9'!N34","v":506},null,{"$error":"#NAME?"}]
["Total external revenues",null,{"$f":"'Bell Wireline HIST p9'!G35","v":{"$error":"#NAME?"}},null,{"$f":"'Bell Wireline HIST p9'!N35","v":2985},null,{"$error":"#NAME?"},{"$f":"(C20-F20)/F20","v":{"$error":"#NAME?"}},{"$f":"'Bell Wireline HIST p9'!E35","v":{"$error":"#NAME?"}},null,{"$f":"'Bell Wireline HIST p9'!O35+'Bell Wireline HIST p9'!P35+'Bell Wireline HIST p9'!Q35+'Bell Wireline HIST p9'!N35","v":11820},null,{"$error":"#NAME?"}]
["Total operating revenues",null,{"$f":"'Bell Wireline HIST p9'!G36","v":{"$error":"#NAME?"}},null,{"$f":"'Bell Wireline HIST p9'!N36","v":3079},null,{"$error":"#NAME?"},{"$f":"(C21-F21)/F21","v":{"$error":"#NAME?"}},{"$f":"'Bell Wireline HIST p9'!E36","v":{"$error":"#NAME?"}},null,{"$f":"'Bell Wireline HIST p9'!O36+'Bell Wireline HIST p9'!P36+'Bell Wireline HIST p9'!Q36+'Bell Wireline HIST p9'!N36","v":12178},null,{"$error":"#NAME?"}]
["Operating costs",null,{"$f":"'Bell Wireline HIST p9'!G37","v":{"$error":"#NAME?"}},null,{"$f":"'Bell Wireline HIST p9'!N37","v":-1753},null,{"$error":"#NAME?"},{"$f":"(-C22+F22)/F22","v":{"$error":"#NAME?"}},{"$f":"'Bell Wireline HIST p9'!E37","v":{"$error":"#NAME?"}},null,{"$f":"'Bell Wireline HIST p9'!O37+'Bell Wireline HIST p9'!P37+'Bell Wireline HIST p9'!Q37+'Bell Wireline HIST p9'!N37","v":-6863},null,{"$error":"#NAME?"}]
["Adjusted EBITDA",null,{"$f":"'Bell Wireline HIST p9'!G38","v":{"$error":"#NAME?"}},null,{"$f":"'Bell Wireline HIST p9'!N38","v":1326},null,{"$error":"#NAME?"},{"$f":"(C23-F23)/F23","v":{"$error":"#NAME?"}},{"$f":"'Bell Wireline HIST p9'!E38","v":{"$error":"#NAME?"}},null,{"$f":"'Bell Wireline HIST p9'!O38+'Bell Wireline HIST p9'!P38+'Bell Wireline HIST p9'!Q38+'Bell Wireline HIST p9'!N38","v":5315},null,0]
["Adjusted EBITDA margin",null,{"$f":"'Bell Wireline HIST p9'!G39","v":{"$error":"#NAME?"}},null,{"$f":"'Bell Wireline HIST p9'!N39","v":0.43099999999999999},null,{"$f":"((ROUND(C24,3)-ROUND(E24,3))*100)","v":{"$error":"#NAME?"}},{"$f":"(C24-F24)*100","v":{"$error":"#NAME?"}},{"$f":"'Bell Wireline HIST p9'!E39","v":{"$error":"#NAME?"}},null,{"$f":"K23/K21","v":0.43644276564296269},null,{"$f":"((ROUND(I24,3)-ROUND(K24,3))*100)","v":{"$error":"#NAME?"}}]
[]
["Capital expenditures ",null,{"$f":"'Bell Wireline HIST p9'!G41","v":1251},null,{"$f":"'Bell Wireline HIST p9'!N41","v":1141},null,{"$f":"IF(OR(((ABS(E26-C26)/E26))>100%,((ABS(E26-C26)/E26))<-100%),\"n.m.\",((E26-C26)/ABS(E26)))","v":-9.6406660823838738E-2},{"$f":"(-C26+F26)/F26","v":{"$error":"#DIV/0!"}},{"$f":"'Bell Wireline HIST p9'!E41","v":3887},null,{"$f":"'Bell Wireline HIST p9'!O41+'Bell Wireline HIST p9'!P41+'Bell Wireline HIST p9'!Q41+'Bell Wireline HIST p9'!N41","v":3612},null,{"$f":"IF(OR(((ABS(K26-I26)/K26))>100%,((ABS(K26-I26)/K26))<-100%),\"n.m.\",((K26-I26)/ABS(K26)))","v":-7.6135105204872641E-2}]
["Capital intensity ",null,{"$f":"'Bell Wireline HIST p9'!G42","v":{"$error":"#NAME?"}},null,{"$f":"'Bell Wireline HIST p9'!N42","v":0.37057486196817147},null,{"$f":"((ROUND(E27,3)-ROUND(C27,3))*100)","v":{"$error":"#NAME?"}},{"$f":"(-(C27-F27)*100)","v":{"$error":"#NAME?"}},{"$f":"'Bell Wireline HIST p9'!E42","v":{"$error":"#NAME?"}},null,{"$f":"K26/K21","v":0.29660042699950728},null,{"$f":"((ROUND(K27,3)-ROUND(I27,3))*100)","v":{"$error":"#NAME?"}}]
["Retail high-speed Internet subscribers(4) "]
["Retail net subscriber activations",null,{"$f":"'Bell Wireline HIST p9'!G44","v":63465.865849099995},null,{"$f":"'Bell Wireline HIST p9'!N44","v":47618},null,{"$f":"IF(OR(((ABS(C29-E29)/E29))>100%,((ABS(C29-E29)/E29))<-100%),\"n.m.\",((C29-E29)/ABS(E29)))","v":0.33281250470620344},{"$f":"(C29-F29)/F29","v":{"$error":"#DIV/0!"}},{"$f":"'Bell Wireline HIST p9'!E44","v":201762},null,{"$f":"'Bell Wireline HIST p9'!O44+'Bell Wireline HIST p9'!P44+'Bell Wireline HIST p9'!Q44+'Bell Wireline HIST p9'!N44","v":152285},null,{"$f":"IF(OR(((ABS(I29-K29)/K29))>100%,((ABS(I29-K29)/K29))<-100%),\"n.m.\",((I29-K29)/ABS(K29)))","v":0.32489739632925108}]
["Retail subscribers EOP(A) (B)",null,{"$f":"'Bell Wireline HIST p9'!G45","v":4258570},null,{"$f":"'Bell Wireline HIST p9'!N45","v":3861652.7233591001},null,0.10278430119828,{"$f":"(C30-F30)/F30","v":{"$error":"#DIV/0!"}},{"$f":"'Bell Wireline HIST p9'!E45","v":4258570},null,{"$f":"'Bell Wireline HIST p9'!L45","v":3861652.7233591001},null,0.10278430119828]
["Retail TV subscribers(4)"]
["Retail net subscriber activations (losses) ",null,{"$f":"'Bell Wireline HIST p9'!G47","v":14183},null,{"$f":"'Bell Wireline HIST p9'!N47","v":6049},null,"n.m.",{"$f":"-(C32-F32)/F32","v":{"$error":"#DIV/0!"}},{"$f":"'Bell Wireline HIST p9'!E47","v":5148},null,{"$f":"'Bell Wireline HIST p9'!O47+'Bell Wireline HIST p9'!P47+'Bell Wireline HIST p9'!Q47+'Bell Wireline HIST p9'!N47","v":2530},null,"n.m."]
["   Internet protocol television (IPTV)",null,{"$f":"'Bell Wireline HIST p9'!G48","v":40209},null,{"$f":"'Bell Wireline HIST p9'!N48","v":29191},null,0.37744510294268779,{"$f":"(C33-F33)/F33","v":{"$error":"#DIV/0!"}},{"$f":"'Bell Wireline HIST p9'!E48","v":94400},null,{"$f":"'Bell Wireline HIST p9'!O48+'Bell Wireline HIST p9'!P48+'Bell Wireline HIST p9'!Q48+'Bell Wireline HIST p9'!N48","v":76068},null,0.24099489930062576]
["   Satellite",null,{"$f":"+'Bell Wireline HIST p9'!G49","v":-26026},null,{"$f":"+'Bell Wireline HIST p9'!N49","v":-23142},null,-0.12462189957652753,null,{"$f":"'Bell Wireline HIST p9'!E49","v":-89252},null,{"$f":"'Bell Wireline HIST p9'!O49+'Bell Wireline HIST p9'!P49+'Bell Wireline HIST p9'!Q49+'Bell Wireline HIST p9'!N49","v":-73538},null,-0.21368544154042807]
["Total retail subscribers EOP(A) (B)",null,{"$f":"'Bell Wireline HIST p9'!G50","v":2751498},null,{"$f":"'Bell Wireline HIST p9'!N50","v":2735010.1380113},null,6.0284463883884419E-3,{"$f":"(C35-F35)/F35","v":{"$error":"#DIV/0!"}},{"$f":"'Bell Wireline HIST p9'!E50","v":2751498},null,{"$f":"'Bell Wireline HIST p9'!L50","v":2735010.1380113},null,6.0284463883884419E-3]
["   IPTV(A) (B)",null,{"$f":"'Bell Wireline HIST p9'!G51","v":1988181},null,{"$f":"'Bell Wireline HIST p9'!N51","v":1882441.1380113999},null,5.6171669782091087E-2,{"$f":"(C36-F36)/F36","v":{"$error":"#DIV/0!"}},{"$f":"'Bell Wireline HIST p9'!E51","v":1988181},null,{"$f":"'Bell Wireline HIST p9'!L51","v":1882441.1380113999},null,5.6171669782091087E-2]
["   Satellite",null,{"$f":"'Bell Wireline HIST p9'!G52","v":763317},null,{"$f":"'Bell Wireline HIST p9'!N52","v":852568.9999999},null,-0.1046859550369653,null,{"$f":"'Bell Wireline HIST p9'!E52","v":763317},null,{"$f":"'Bell Wireline HIST p9'!N52","v":852568.9999999},null,-0.1046859550369653]
["Retail residential network access services (NAS)(4)"]
["Retail residential NAS lines net losses",null,{"$f":"'Bell Wireline HIST p9'!G54","v":-37878},null,{"$f":"'Bell Wireline HIST p9'!N54","v":-40211},null,5.8018950038546666E-2,{"$f":"-(C39-F39)/F39","v":{"$error":"#DIV/0!"}},{"$f":"'Bell Wireline HIST p9'!E54","v":-175788},null,{"$f":"'Bell Wireline HIST p9'!O54+'Bell Wireline HIST p9'!P54+'Bell Wireline HIST p9'!Q54+'Bell Wireline HIST p9'!N54","v":-185327},null,5.1471183367776958E-2]
["Retail residential NAS lines(A) (B)",null,{"$f":"'Bell Wireline HIST p9'!G55","v":2190771},null,{"$f":"'Bell Wireline HIST p9'!N55","v":2298605},null,-4.6912801460015967E-2,{"$f":"(C40-F40)/F40","v":{"$error":"#DIV/0!"}},{"$f":"'Bell Wireline HIST p9'!E55","v":2190771},null,{"$f":"'Bell Wireline HIST p9'!N55","v":2298605},null,-4.6912801460015967E-2]
[]
["n.m. : not meaningful"]
["(A)","In Q1 2022, as a result of the acquisition of EBOX and other related companies, our retail high-speed Internet, retail IPTV and retail residential NAS lines subscriber bases increased by 67,090, 9,025 and 3,456 subscribers, respectively."]
["(B)","In Q4 2022, as a result of the acquisition of Distributel Communications Limited (Distributel), our retail high-speed Internet, retail IPTV and retail residential NAS lines subscriber bases increased by 128,065, 2,315 and 64,498 subscribers, respectively."]

{"sheet":"CTS Summary p6","index":9,"n_rows":24,"n_cols":10,"rows_kept":24,"cut":false,"hidden":false,"merged":[]}
[null,null,null,null,null,null,null,null,null,"Bell SCT"]
[]
[null,null,"T2","T2",null,"% de","Cumul","Cumul",null,"% de"]
["(en millions de dollars canadiens, sauf indication contraire) (non audité)",null,"2025","2024",null,"variation","2025","2024",null,"variation"]
["Bell SCT"]
["Produits d’exploitation"]
["Services sans fil ",null,1783,1788,null,-2.7964205816554811E-3,3542,3562,null,-5.614823133071308E-3]
["Services de données filaires",null,2025,2034,null,-4.4247787610619468E-3,4039,4046,null,-1.7301038062283738E-3]
["Services voix filaires",null,624,677,null,-7.8286558345642535E-2,1253,1360,null,-7.8676470588235292E-2]
["Autres services sur fil",null,77,79,null,-2.5316455696202531E-2,156,160,null,-2.5000000000000001E-2]
["Produits externes tirés des services",null,4509,4578,null,-1.5072083879423329E-2,8990,9128,null,-1.5118317265556529E-2]
["Produits intersectoriels tirés des services",null,7,8,null,-0.125,14,14,null,0]
["Produits d’exploitation tirés des services",null,4516,4586,null,-1.5263846489315308E-2,9004,9142,null,-1.5095165171734851E-2]
["Services sans fil ",null,594,568,null,4.5774647887323945E-2,1218,1252,null,-2.7156549520766772E-2]
["Services sur fil",null,224,129,null,0.73643410852713176,358,264,null,0.35606060606060608]
["Produits externes/d’exploitation tirés des produits",null,818,697,null,0.17360114777618366,1576,1516,null,3.9577836411609502E-2]
["Total des produits externes ",null,5327,5275,null,9.857819905213271E-3,10566,10644,null,-7.328072153325817E-3]
["Total des produits d’exploitation",null,5334,5283,null,9.6536059057353782E-3,10580,10658,null,-7.3184462375680244E-3]
["Coûts d’exploitation",null,-2895,-2804,null,-3.2453637660485021E-2,-5742,-5731,null,-1.9193857965451055E-3]
["BAIIA ajusté",null,2439,2479,null,-1.6135538523598225E-2,4838,4927,null,-1.8063730464785873E-2]
["Marge du BAIIA ajusté",null,"45,7  %",0.46924096157486278,null,-1.1999999999999955,"45,7  %",0.46200000000000002,null,-0.50000000000000044]
[]
["Dépenses d’investissement ",null,727,945,null,0.23068783068783069,1431,1920,null,0.25468750000000001]
["Intensité du capital ",null,"13,6  %",0.17899999999999999,null,4.299999999999998,"13,5  %",0.18,null,4.4999999999999982]

{"sheet":"CTS HIST Info p7","index":10,"n_rows":27,"n_cols":13,"rows_kept":27,"cut":false,"hidden":false,"merged":[[3,0,3,1]]}
[null,null,null,null,null,null,null,null,null,null,null,null,"Bell SCT – Tendance historique"]
[]
[null,null,"Cumul",null,null,null,null,"TOTAL"]
["(en millions de dollars canadiens, sauf indication contraire) (non audité)",null,"2025",null,"T2 25","T1 25",null,"2024",null,"T4 24","T3 24","T2 24","T1 24"]
["Bell SCT"]
["Produits d’exploitation"]
["Services sans fil ",null,3542,null,1783,1759,null,7149,null,1776,1811,1788,1774]
["Services de données filaires",null,4039,null,2025,2014,null,8117,null,2033,2038,2034,2012]
["Services voix filaires",null,1253,null,624,629,null,2672,null,649,663,677,683]
["Autres services sur fil",null,156,null,77,79,null,318,null,82,76,79,81]
["Produits externes tirés des services",null,8990,null,4509,4481,null,18256,null,4540,4588,4578,4550]
["Produits intersectoriels tirés des services",null,14,null,7,7,null,27,null,6,7,8,6]
["Produits d’exploitation tirés des services",null,9004,null,4516,4488,null,18283,null,4546,4595,4586,4556]
["Services sans fil ",null,1218,null,594,624,null,2715,null,894,569,568,684]
["Services sur fil",null,358,null,224,134,null,621,null,241,116,129,135]
["Wireline equipment and other",null,21,null,null,null,null,47,null,8,0,28,11]
["Produits externes tirés des produits",null,1597,null,null,null,null,3383,null,688,799,1066,830]
["Produits intersectoriels tirés des produits",null,0,null,null,null,null,0,null,0,0,0,0]
["Produits externes/d’exploitation tirés des produits",null,1576,null,818,758,null,3336,null,1135,685,697,819]
["Total des produits externes ",null,10566,null,5327,5239,null,21592,null,5675,5273,5275,5369]
["Total des produits d’exploitation",null,10580,null,5334,5246,null,21619,null,5681,5280,5283,5375]
["Coûts d’exploitation",null,-5742,null,-2895,-2847,null,-11788,null,-3245,-2812,-2804,-2927]
["BAIIA ajusté",null,4838,null,2439,2399,null,9831,null,2436,2468,2479,2448]
["Marge du BAIIA ajusté",null,0.45727788279773157,null,0.45725534308211474,0.45700000000000002,null,0.45473888709005966,null,0.42879774687555006,0.46700000000000003,0.46924096157486278,0.45500000000000002]
[]
["Dépenses d’investissement ",null,1431,null,727,704,null,3746,null,907,919,945,975]
["Intensité du capital ",null,0.13525519848771267,null,0.13629546306711662,0.13400000000000001,null,0.17299999999999999,null,0.16,0.17405303030303029,0.17899999999999999,0.18099999999999999]

{"sheet":"CTS Metrics Summary p8","index":11,"n_rows":37,"n_cols":10,"rows_kept":37,"cut":false,"hidden":false,"merged":[[32,1,32,9],[33,1,33,9],[35,1,35,9],[36,1,36,9],[34,1,34,9]]}
[null,null,null,null,null,null,null,null,null,"Indicateurs de Bell SCT"]
[]
[null,null,"T2","T2",null,"% de","Cumul","Cumul",null,"% de"]
["(en millions de dollars canadiens, sauf indication contraire) (non audité)",null,"2025","2024",null,"variation","2025","2024",null,"variation"]
["Abonnés utilisant des téléphones mobiles (3)"]
["Activations brutes d’abonnés",null,510597,575334,null,-0.11252072709069862,979182,1082773,null,-9.5671946012691481E-2]
["Services postpayés",null,331438,389213,null,-0.14844057110117082,651688,756087,null,-0.13807802541241948]
["Services prépayés",null,179159,186121,null,-3.7405773663369529E-2,327494,326686,null,2.4733230074138468E-3]
["Activations nettes d’abonnés",null,94479,131043,null,-0.27902291614202973,93883,156251,null,-0.39915264542306927]
["Services postpayés",null,44547,78500,null,-0.4325222929936306,34949,123747,null,-0.71757699176545697]
["Services prépayés",null,49932,52543,null,-4.9692632700835508E-2,58934,32504,null,0.81313069160718676]
["Abonnés à la fin de la période (B) (C)",null,10382457,10337495,null,4.3494096006817902E-3,10382457,10337495,null,4.3494096006817902E-3]
["Services postpayés",null,9565385,9440775,null,1.3199128249534599E-2,9565385,9440775,null,1.3199128249534599E-2]
["Services prépayés (B) (C)",null,817072,896720,null,-8.8821482737086274E-2,817072,896720,null,-8.8821482737086274E-2]
["Revenu moyen par utilisateur (RMU) combiné ($/mois) (3) (B) (C) (D) ",null,57.61,58.04,null,-7.4086836664369353E-3,57.35,58.09,null,-1.2738853503184747E-2]
["Taux de désabonnement combiné (%) (moyen par mois) (3)",null,1.3599999999999999E-2,1.47E-2,null,0.11000000000000003,1.4500000000000001E-2,1.5299999999999999E-2,null,7.9999999999999863E-2]
["Services postpayés",null,1.06E-2,1.18E-2,null,0.11999999999999997,1.1299999999999999E-2,1.2E-2,null,7.000000000000009E-2]
["Services prépayés",null,5.0599999999999999E-2,4.5999999999999999E-2,null,-0.45999999999999996,5.4100000000000002E-2,5.16E-2,null,-0.25000000000000022]
["Activations d’abonnés utilisant des appareils mobiles (3)"]
["Activations nettes d’abonnés ",null,97502,87917,null,0.10902328332404426,133486,154323,null,-0.13502199931312894]
["Abonnés à la fin de la période",null,3176916,2886871,null,0.10047037086173924,3176916,2886871,null,0.10047037086173924]
["Abonnés des services Internet haute vitesse de détail (3)"]
["Activations nettes d’abonnés des services de détail",null,4999,23841,null,-0.79031919802021722,14514,54919,null,-0.73571987836632136]
["Abonnés des services de détail à la fin de la période (A) (C)",null,4421961,4520553,null,-2.1809721067311896E-2,4421961,4520553,null,-2.1809721067311896E-2]
["Abonnés des services de télé sur protocole Internet (télé IP) de détail (3)"]
["(Pertes) activations nettes d’abonnés des services de télé IP de détail",null,-15851,-1313,null,"n.s.",-31822,12861,null,"n.s."]
["Abonnés des services de télé IP de détail à la fin de la période (A) (E) ",null,2100690,2124200,null,-1.1067696073816025E-2,2100690,2124200,null,-1.1067696073816025E-2]
["Services d’accès au réseau (SAR) résidentiels de détail (3)"]
["Pertes nettes d’abonnés des SAR résidentiels de détail",null,-44700,-53250,null,0.16056338028169015,-92130,-97161,null,5.1780035199308364E-2]
["Abonnés des SAR résidentiels de détail (A) ",null,1727911,1924456,null,-0.10213016041936007,1727911,1924456,null,-0.10213016041936007]
["n.s. : non significatif"]
[]
["(A)","Au T1 2025, nous avons réduit notre clientèle d’abonnés des services Internet haute vitesse de détail, des services de télé IP de détail et des SAR résidentiels de détail de 80 666 abonnés, de 441 abonnés et de 14 150  abonnés, respectivement, au 31 mars 2025, car nous avons cessé de vendre de nouveaux forfaits des marques Distributel, Acanac, Oricom et B2B2C pour ces services. En outre, au début du T1 2025, nous avons réduit notre clientèle d'abonnés des services Internet haute vitesse de détail de 2 783 abonnés pour tenir compte des désactivations de clients de l’exercice précédent, à la suite d’un examen des comptes de nos abonnés."]
["(B)","Au T4 2024, nous avons retiré 124 216 abonnés des services prépayés utilisant des téléphones mobiles de Bell de notre clientèle d’abonnés des téléphones mobiles prépayés au 31 décembre 2024, car nous avons cessé de vendre de nouveaux forfaits pour ce service à compter de cette date."]
["(C)","Au T3 2024, nous avons retiré 77 971 abonnés des services prépayés utilisant des téléphones mobiles de Virgin Plus de notre clientèle d’abonnés des téléphones mobiles prépayés au 30 septembre 2024, car nous avons cessé de vendre de nouveaux forfaits pour ce service à compter de cette date. De plus, en raison d’une récente décision du Conseil de la radiodiffusion et des télécommunications canadiennes (CRTC) visant les services d’accès Internet haute vitesse de gros, nous ne sommes plus en mesure de revendre les services d’accès Internet par câble à de nouveaux clients dans notre zone de couverture des services sur fil depuis le 12 septembre 2024 et, par conséquent, nous avons retiré l’ensemble des 106 259 abonnés existants des services de câblodistribution dans la zone de couverture des services sur fil de notre clientèle d’abonnés aux services d’accès Internet haute vitesse de détail à cette date."]
["(D)","Le RMU combiné des abonnés utilisant des téléphones mobiles se définit comme les produits externes tirés des services sans fil du secteur Bell SCT divisés par le nombre moyen d’abonnés utilisant des téléphones mobiles pour la période visée, et est exprimé en unité monétaire par mois. Voir la note 3 Indicateurs de performance clés dans les notes annexes du présent rapport pour en savoir plus sur cette mesure. "]
["(E)","Au T2 2024, nous avons augmenté le nombre d’abonnés des services de télé IP de détail de 40 997 pour aligner le calcul de la désactivation de nos services de télé en continu Télé Fibe sur celui de notre service de Télé Fibe traditionnel."]

{"sheet":"BCE Inc. Seg Info Summary p4","index":12,"n_rows":43,"n_cols":12,"rows_kept":43,"cut":false,"hidden":true,"merged":[]}
[null,null,null,null,null,null,null,null,null,null,null,"BCE (1) (2)"]
[null,null,null,null,null,null,null,null,null,null,null,"Segmented Data "]
[]
[]
["(In millions of Canadian dollars, except where otherwise indicated) (unaudited)","Q4\n2022","Q4\n2021",null,"$ change","% change",null,"TOTAL\n2022","TOTAL\n2021",null,"$ change","% change"]
[]
["Operating revenues"]
["Bell Wireless",{"$f":"'BCE Inc. Seg Info HIST p5'!G23","v":{"$error":"#NAME?"}},{"$f":"'BCE Inc. Seg Info HIST p5'!N23","v":2475},null,{"$f":"B8-C8","v":{"$error":"#NAME?"}},{"$f":"IF(OR((+E8/(ABS(C8)))>100%,(+E8/(ABS(C8)))<-100%),\"n.m.\",(+E8/(ABS(C8))))","v":{"$error":"#NAME?"}},null,{"$f":"'BCE Inc. Seg Info HIST p5'!E23","v":{"$error":"#NAME?"}},{"$f":"'BCE Inc. Seg Info HIST p5'!O23+'BCE Inc. Seg Info HIST p5'!P23+'BCE Inc. Seg Info HIST p5'!Q23+'BCE Inc. Seg Info HIST p5'!N23","v":8999},null,{"$f":"H8-I8","v":{"$error":"#NAME?"}},{"$f":"IF(OR((+K8/(ABS(I8)))>100%,(+K8/(ABS(I8)))<-100%),\"n.m.\",(+K8/(ABS(I8))))","v":{"$error":"#NAME?"}}]
["Bell Wireline",{"$f":"'BCE Inc. Seg Info HIST p5'!G24","v":{"$error":"#NAME?"}},{"$f":"'BCE Inc. Seg Info HIST p5'!N24","v":3079},null,{"$f":"B9-C9","v":{"$error":"#NAME?"}},{"$f":"IF(OR((+E9/(ABS(C9)))>100%,(+E9/(ABS(C9)))<-100%),\"n.m.\",(+E9/(ABS(C9))))","v":{"$error":"#NAME?"}},null,{"$f":"'BCE Inc. Seg Info HIST p5'!E24","v":{"$error":"#NAME?"}},{"$f":"'BCE Inc. Seg Info HIST p5'!O24+'BCE Inc. Seg Info HIST p5'!P24+'BCE Inc. Seg Info HIST p5'!Q24+'BCE Inc. Seg Info HIST p5'!N24","v":12178},null,{"$f":"H9-I9","v":{"$error":"#NAME?"}},{"$f":"IF(OR((+K9/(ABS(I9)))>100%,(+K9/(ABS(I9)))<-100%),\"n.m.\",(+K9/(ABS(I9))))","v":{"$error":"#NAME?"}}]
["Bell Media",{"$f":"'BCE Inc. Seg Info HIST p5'!G25","v":{"$error":"#NAME?"}},{"$f":"'BCE Inc. Seg Info HIST p5'!N25","v":849},null,{"$f":"B10-C10","v":{"$error":"#NAME?"}},{"$f":"IF(OR((+E10/(ABS(C10)))>100%,(+E10/(ABS(C10)))<-100%),\"n.m.\",(+E10/(ABS(C10))))","v":{"$error":"#NAME?"}},null,{"$f":"'BCE Inc. Seg Info HIST p5'!E25","v":{"$error":"#NAME?"}},{"$f":"'BCE Inc. Seg Info HIST p5'!O25+'BCE Inc. Seg Info HIST p5'!P25+'BCE Inc. Seg Info HIST p5'!Q25+'BCE Inc. Seg Info HIST p5'!N25","v":3036},null,{"$f":"H10-I10","v":{"$error":"#NAME?"}},{"$f":"IF(OR((+K10/(ABS(I10)))>100%,(+K10/(ABS(I10)))<-100%),\"n.m.\",(+K10/(ABS(I10))))","v":{"$error":"#NAME?"}}]
["Inter-segment eliminations",{"$f":"'BCE Inc. Seg Info HIST p5'!G26","v":{"$error":"#NAME?"}},{"$f":"'BCE Inc. Seg Info HIST p5'!N26","v":-194},null,{"$f":"B11-C11","v":{"$error":"#NAME?"}},{"$f":"IF(OR((+E11/(ABS(C11)))>100%,(+E11/(ABS(C11)))<-100%),\"n.m.\",(+E11/(ABS(C11))))","v":{"$error":"#NAME?"}},null,{"$f":"'BCE Inc. Seg Info HIST p5'!E26","v":{"$error":"#NAME?"}},{"$f":"'BCE Inc. Seg Info HIST p5'!O26+'BCE Inc. Seg Info HIST p5'!P26+'BCE Inc. Seg Info HIST p5'!Q26+'BCE Inc. Seg Info HIST p5'!N26","v":-764},null,{"$f":"H11-I11","v":{"$error":"#NAME?"}},{"$f":"IF(OR((+K11/(ABS(I11)))>100%,(+K11/(ABS(I11)))<-100%),\"n.m.\",(+K11/(ABS(I11))))","v":{"$error":"#NAME?"}}]
["Total",{"$f":"'BCE Inc. Seg Info HIST p5'!G27","v":{"$error":"#NAME?"}},{"$f":"'BCE Inc. Seg Info HIST p5'!N27","v":6209},null,{"$f":"B12-C12","v":{"$error":"#NAME?"}},{"$f":"IF(OR((+E12/(ABS(C12)))>100%,(+E12/(ABS(C12)))<-100%),\"n.m.\",(+E12/(ABS(C12))))","v":{"$error":"#NAME?"}},null,{"$f":"'BCE Inc. Seg Info HIST p5'!E27","v":{"$error":"#NAME?"}},{"$f":"'BCE Inc. Seg Info HIST p5'!O27+'BCE Inc. Seg Info HIST p5'!P27+'BCE Inc. Seg Info HIST p5'!Q27+'BCE Inc. Seg Info HIST p5'!N27","v":23449},null,{"$f":"H12-I12","v":{"$error":"#NAME?"}},{"$f":"IF(OR((+K12/(ABS(I12)))>100%,(+K12/(ABS(I12)))<-100%),\"n.m.\",(+K12/(ABS(I12))))","v":{"$error":"#NAME?"}}]
[]
["Operating costs"]
["Bell Wireless",{"$f":"'BCE Inc. Seg Info HIST p5'!G30","v":{"$error":"#NAME?"}},{"$f":"'BCE Inc. Seg Info HIST p5'!N30","v":-1524},null,{"$f":"B15-C15","v":{"$error":"#NAME?"}},{"$f":"IF(OR((+E15/(ABS(C15)))>100%,(+E15/(ABS(C15)))<-100%),\"n.m.\",(+E15/(ABS(C15))))","v":{"$error":"#NAME?"}},null,{"$f":"'BCE Inc. Seg Info HIST p5'!E30","v":{"$error":"#NAME?"}},{"$f":"'BCE Inc. Seg Info HIST p5'!O30+'BCE Inc. Seg Info HIST p5'!P30+'BCE Inc. Seg Info HIST p5'!Q30+'BCE Inc. Seg Info HIST p5'!N30","v":-5146},null,{"$f":"H15-I15","v":{"$error":"#NAME?"}},{"$f":"IF(OR((+K15/(ABS(I15)))>100%,(+K15/(ABS(I15)))<-100%),\"n.m.\",(+K15/(ABS(I15))))","v":{"$error":"#NAME?"}}]
["Bell Wireline",{"$f":"'BCE Inc. Seg Info HIST p5'!G31","v":{"$error":"#NAME?"}},{"$f":"'BCE Inc. Seg Info HIST p5'!N31","v":-1753},null,{"$f":"B16-C16","v":{"$error":"#NAME?"}},{"$f":"IF(OR((+E16/(ABS(C16)))>100%,(+E16/(ABS(C16)))<-100%),\"n.m.\",(+E16/(ABS(C16))))","v":{"$error":"#NAME?"}},null,{"$f":"'BCE Inc. Seg Info HIST p5'!E31","v":{"$error":"#NAME?"}},{"$f":"'BCE Inc. Seg Info HIST p5'!O31+'BCE Inc. Seg Info HIST p5'!P31+'BCE Inc. Seg Info HIST p5'!Q31+'BCE Inc. Seg Info HIST p5'!N31","v":-6863},null,{"$f":"H16-I16","v":{"$error":"#NAME?"}},{"$f":"IF(OR((+K16/(ABS(I16)))>100%,(+K16/(ABS(I16)))<-100%),\"n.m.\",(+K16/(ABS(I16))))","v":{"$error":"#NAME?"}}]
["Bell Media",{"$f":"'BCE Inc. Seg Info HIST p5'!G32","v":{"$error":"#NAME?"}},{"$f":"'BCE Inc. Seg Info HIST p5'!N32","v":-696},null,{"$f":"B17-C17","v":{"$error":"#NAME?"}},{"$f":"IF(OR((+E17/(ABS(C17)))>100%,(+E17/(ABS(C17)))<-100%),\"n.m.\",(+E17/(ABS(C17))))","v":{"$error":"#NAME?"}},null,{"$f":"'BCE Inc. Seg Info HIST p5'!E32","v":{"$error":"#NAME?"}},{"$f":"'BCE Inc. Seg Info HIST p5'!O32+'BCE Inc. Seg Info HIST p5'!P32+'BCE Inc. Seg Info HIST p5'!Q32+'BCE Inc. Seg Info HIST p5'!N32","v":-2311},null,{"$f":"H17-I17","v":{"$error":"#NAME?"}},{"$f":"IF(OR((+K17/(ABS(I17)))>100%,(+K17/(ABS(I17)))<-100%),\"n.m.\",(+K17/(ABS(I17))))","v":{"$error":"#NAME?"}}]
["Inter-segment eliminations",{"$f":"'BCE Inc. Seg Info HIST p5'!G33","v":{"$error":"#NAME?"}},{"$f":"'BCE Inc. Seg Info HIST p5'!N33","v":194},null,{"$f":"B18-C18","v":{"$error":"#NAME?"}},{"$f":"IF(OR((+E18/(ABS(C18)))>100%,(+E18/(ABS(C18)))<-100%),\"n.m.\",(+E18/(ABS(C18))))","v":{"$error":"#NAME?"}},null,{"$f":"'BCE Inc. Seg Info HIST p5'!E33","v":{"$error":"#NAME?"}},{"$f":"'BCE Inc. Seg Info HIST p5'!O33+'BCE Inc. Seg Info HIST p5'!P33+'BCE Inc. Seg Info HIST p5'!Q33+'BCE Inc. Seg Info HIST p5'!N33","v":764},null,{"$f":"H18-I18","v":{"$error":"#NAME?"}},{"$f":"IF(OR((+K18/(ABS(I18)))>100%,(+K18/(ABS(I18)))<-100%),\"n.m.\",(+K18/(ABS(I18))))","v":{"$error":"#NAME?"}}]
["Total",{"$f":"'BCE Inc. Seg Info HIST p5'!G34","v":{"$error":"#NAME?"}},{"$f":"'BCE Inc. Seg Info HIST p5'!N34","v":-3779},null,{"$f":"B19-C19","v":{"$error":"#NAME?"}},{"$f":"IF(OR((+E19/(ABS(C19)))>100%,(+E19/(ABS(C19)))<-100%),\"n.m.\",(+E19/(ABS(C19))))","v":{"$error":"#NAME?"}},null,{"$f":"'BCE Inc. Seg Info HIST p5'!E34","v":{"$error":"#NAME?"}},{"$f":"'BCE Inc. Seg Info HIST p5'!O34+'BCE Inc. Seg Info HIST p5'!P34+'BCE Inc. Seg Info HIST p5'!Q34+'BCE Inc. Seg Info HIST p5'!N34","v":-13556},null,{"$f":"H19-I19","v":{"$error":"#NAME?"}},{"$f":"IF(OR((+K19/(ABS(I19)))>100%,(+K19/(ABS(I19)))<-100%),\"n.m.\",(+K19/(ABS(I19))))","v":{"$error":"#NAME?"}}]
[]
["Adjusted EBITDA"]
["Bell Wireless",{"$f":"'BCE Inc. Seg Info HIST p5'!G37","v":{"$error":"#NAME?"}},{"$f":"'BCE Inc. Seg Info HIST p5'!N37","v":951},null,{"$f":"B22-C22","v":{"$error":"#NAME?"}},{"$f":"IF(OR((+E22/(ABS(C22)))>100%,(+E22/(ABS(C22)))<-100%),\"n.m.\",(+E22/(ABS(C22))))","v":{"$error":"#NAME?"}},null,{"$f":"'BCE Inc. Seg Info HIST p5'!E37","v":{"$error":"#NAME?"}},{"$f":"'BCE Inc. Seg Info HIST p5'!O37+'BCE Inc. Seg Info HIST p5'!P37+'BCE Inc. Seg Info HIST p5'!Q37+'BCE Inc. Seg Info HIST p5'!N37","v":3853},null,{"$f":"H22-I22","v":{"$error":"#NAME?"}},{"$f":"IF(OR((+K22/(ABS(I22)))>100%,(+K22/(ABS(I22)))<-100%),\"n.m.\",(+K22/(ABS(I22))))","v":{"$error":"#NAME?"}}]
["Margin",{"$f":"'BCE Inc. Seg Info HIST p5'!G38","v":{"$error":"#NAME?"}},{"$f":"'BCE Inc. Seg Info HIST p5'!N38","v":0.38400000000000001},null,null,{"$f":"((ROUND(B23,3)-ROUND(C23,3))*100)","v":{"$error":"#NAME?"}},null,{"$f":"'BCE Inc. Seg Info HIST p5'!E38","v":{"$error":"#NAME?"}},{"$f":"I22/I8","v":0.42815868429825538},null,null,{"$f":"((ROUND(H23,3)-ROUND(I23,3))*100)","v":{"$error":"#NAME?"}}]
["Bell Wireline",{"$f":"'BCE Inc. Seg Info HIST p5'!G39","v":{"$error":"#NAME?"}},{"$f":"'BCE Inc. Seg Info HIST p5'!N39","v":1326},null,{"$f":"B24-C24","v":{"$error":"#NAME?"}},{"$f":"IF(OR((+E24/(ABS(C24)))>100%,(+E24/(ABS(C24)))<-100%),\"n.m.\",(+E24/(ABS(C24))))","v":{"$error":"#NAME?"}},null,{"$f":"'BCE Inc. Seg Info HIST p5'!E39","v":{"$error":"#NAME?"}},{"$f":"'BCE Inc. Seg Info HIST p5'!O39+'BCE Inc. Seg Info HIST p5'!P39+'BCE Inc. Seg Info HIST p5'!Q39+'BCE Inc. Seg Info HIST p5'!N39","v":5315},null,{"$f":"H24-I24","v":{"$error":"#NAME?"}},0]
["Margin ",{"$f":"'BCE Inc. Seg Info HIST p5'!G40","v":{"$error":"#NAME?"}},{"$f":"'BCE Inc. Seg Info HIST p5'!N40","v":0.43099999999999999},null,null,{"$f":"((ROUND(B25,3)-ROUND(C25,3))*100)","v":{"$error":"#NAME?"}},null,{"$f":"'BCE Inc. Seg Info HIST p5'!E40","v":{"$error":"#NAME?"}},{"$f":"I24/I9","v":0.43644276564296269},null,null,{"$f":"((ROUND(H25,3)-ROUND(I25,3))*100)","v":{"$error":"#NAME?"}}]
["Bell Media",{"$f":"'BCE Inc. Seg Info HIST p5'!G41","v":{"$error":"#NAME?"}},{"$f":"'BCE Inc. Seg Info HIST p5'!N41","v":153},null,{"$f":"B26-C26","v":{"$error":"#NAME?"}},{"$f":"IF(OR((+E26/(ABS(C26)))>100%,(+E26/(ABS(C26)))<-100%),\"n.m.\",(+E26/(ABS(C26))))","v":{"$error":"#NAME?"}},null,{"$f":"'BCE Inc. Seg Info HIST p5'!E41","v":{"$error":"#NAME?"}},{"$f":"'BCE Inc. Seg Info HIST p5'!O41+'BCE Inc. Seg Info HIST p5'!P41+'BCE Inc. Seg Info HIST p5'!Q41+'BCE Inc. Seg Info HIST p5'!N41","v":725},null,{"$f":"H26-I26","v":{"$error":"#NAME?"}},{"$f":"IF(OR((+K26/(ABS(I26)))>100%,(+K26/(ABS(I26)))<-100%),\"n.m.\",(+K26/(ABS(I26))))","v":{"$error":"#NAME?"}}]
["Margin",{"$f":"'BCE Inc. Seg Info HIST p5'!G42","v":{"$error":"#NAME?"}},{"$f":"'BCE Inc. Seg Info HIST p5'!N42","v":0.18},null,null,{"$f":"((ROUND(B27,3)-ROUND(C27,3))*100)","v":{"$error":"#NAME?"}},null,{"$f":"('BCE Inc. Seg Info HIST p5'!E42)","v":{"$error":"#NAME?"}},{"$f":"I26/I10","v":0.23880105401844531},null,null,{"$f":"((ROUND(H27,3)-ROUND(I27,3))*100)","v":{"$error":"#NAME?"}}]
["Total",{"$f":"'BCE Inc. Seg Info HIST p5'!G43","v":{"$error":"#NAME?"}},{"$f":"'BCE Inc. Seg Info HIST p5'!N43","v":2430},null,{"$f":"B28-C28","v":{"$error":"#NAME?"}},{"$f":"IF(OR((+E28/(ABS(C28)))>100%,(+E28/(ABS(C28)))<-100%),\"n.m.\",(+E28/(ABS(C28))))","v":{"$error":"#NAME?"}},null,{"$f":"'BCE Inc. Seg Info HIST p5'!E43","v":{"$error":"#NAME?"}},{"$f":"'BCE Inc. Seg Info HIST p5'!O43+'BCE Inc. Seg Info HIST p5'!P43+'BCE Inc. Seg Info HIST p5'!Q43+'BCE Inc. Seg Info HIST p5'!N43","v":9893},null,{"$f":"H28-I28","v":{"$error":"#NAME?"}},{"$f":"IF(OR((+K28/(ABS(I28)))>100%,(+K28/(ABS(I28)))<-100%),\"n.m.\",(+K28/(ABS(I28))))","v":{"$error":"#NAME?"}}]
["Margin",{"$f":"'BCE Inc. Seg Info HIST p5'!G44","v":{"$error":"#NAME?"}},{"$f":"'BCE Inc. Seg Info HIST p5'!N44","v":0.39100000000000001},null,null,{"$f":"((ROUND(B29,3)-ROUND(C29,3))*100)","v":{"$error":"#NAME?"}},null,{"$f":"'BCE Inc. Seg Info HIST p5'!E44","v":{"$error":"#NAME?"}},{"$f":"I28/I12","v":0.4218943238517634},null,null,{"$f":"((ROUND(I29,3)-ROUND(H29,3))*100)","v":{"$error":"#NAME?"}}]
[]
["Capital expenditures"]
["Bell Wireless",{"$f":"+'BCE Inc. Seg Info HIST p5'!G47","v":308},{"$f":"+'BCE Inc. Seg Info HIST p5'!N47","v":273},null,{"$f":"C32-B32","v":-35},{"$f":"IF(OR((+E32/(ABS(C32)))>100%,(+E32/(ABS(C32)))<-100%),\"n.m.\",(+E32/(ABS(C32))))","v":-0.12820512820512819},null,{"$f":"+'BCE Inc. Seg Info HIST p5'!E47","v":1084},{"$f":"'BCE Inc. Seg Info HIST p5'!O47+'BCE Inc. Seg Info HIST p5'!P47+'BCE Inc. Seg Info HIST p5'!Q47+'BCE Inc. Seg Info HIST p5'!N47","v":1120},null,{"$f":"I32-H32","v":36},{"$f":"IF(OR((+K32/(ABS(I32)))>100%,(+K32/(ABS(I32)))<-100%),\"n.m.\",(+K32/(ABS(I32))))","v":3.214285714285714E-2}]
["Capital intensity (A)(4)",{"$f":"+'BCE Inc. Seg Info HIST p5'!G48","v":{"$error":"#NAME?"}},{"$f":"+'BCE Inc. Seg Info HIST p5'!N48","v":0.11030303030303031},null,null,{"$f":"((ROUND(C33,3)-ROUND(B33,3))*100)","v":{"$error":"#NAME?"}},null,{"$f":"'BCE Inc. Seg Info HIST p5'!E48","v":{"$error":"#NAME?"}},{"$f":"I32/I8","v":0.12445827314146016},null,null,{"$f":"((ROUND(I33,3)-ROUND(H33,3))*100)","v":{"$error":"#NAME?"}}]
["Bell Wireline",{"$f":"+'BCE Inc. Seg Info HIST p5'!G49","v":1251},{"$f":"+'BCE Inc. Seg Info HIST p5'!N49","v":1141},null,{"$f":"C34-B34","v":-110},{"$f":"IF(OR((+E34/(ABS(C34)))>100%,(+E34/(ABS(C34)))<-100%),\"n.m.\",(+E34/(ABS(C34))))","v":-9.6406660823838738E-2},null,{"$f":"+'BCE Inc. Seg Info HIST p5'!E49","v":3887},{"$f":"'BCE Inc. Seg Info HIST p5'!O49+'BCE Inc. Seg Info HIST p5'!P49+'BCE Inc. Seg Info HIST p5'!Q49+'BCE Inc. Seg Info HIST p5'!N49","v":3612},null,{"$f":"I34-H34","v":-275},{"$f":"IF(OR((+K34/(ABS(I34)))>100%,(+K34/(ABS(I34)))<-100%),\"n.m.\",(+K34/(ABS(I34))))","v":-7.6135105204872641E-2}]
["Capital intensity ",{"$f":"+'BCE Inc. Seg Info HIST p5'!G50","v":{"$error":"#NAME?"}},{"$f":"+'BCE Inc. Seg Info HIST p5'!N50","v":0.37057486196817147},null,null,{"$f":"((ROUND(C35,3)-ROUND(B35,3))*100)","v":{"$error":"#NAME?"}},null,{"$f":"'BCE Inc. Seg Info HIST p5'!E50","v":{"$error":"#NAME?"}},{"$f":"I34/I9","v":0.29660042699950728},null,null,{"$f":"((ROUND(I35,3)-ROUND(H35,3))*100)","v":{"$error":"#NAME?"}}]
["Bell Media",{"$f":"+'BCE Inc. Seg Info HIST p5'!G51","v":79},{"$f":"+'BCE Inc. Seg Info HIST p5'!N51","v":52},null,{"$f":"C36-B36","v":-27},{"$f":"IF(OR((+E36/(ABS(C36)))>100%,(+E36/(ABS(C36)))<-100%),\"n.m.\",(+E36/(ABS(C36))))","v":-0.51923076923076927},null,{"$f":"+'BCE Inc. Seg Info HIST p5'!E51","v":162},{"$f":"'BCE Inc. Seg Info HIST p5'!O51+'BCE Inc. Seg Info HIST p5'!P51+'BCE Inc. Seg Info HIST p5'!Q51+'BCE Inc. Seg Info HIST p5'!N51","v":120},null,{"$f":"I36-H36","v":-42},{"$f":"IF(OR((+K36/(ABS(I36)))>100%,(+K36/(ABS(I36)))<-100%),\"n.m.\",(+K36/(ABS(I36))))","v":-0.35}]
["Capital intensity ",{"$f":"'BCE Inc. Seg Info HIST p5'!G52","v":{"$error":"#NAME?"}},{"$f":"'BCE Inc. Seg Info HIST p5'!N52","v":6.1248527679623084E-2},null,null,{"$f":"((ROUND(C37,3)-ROUND(B37,3))*100)","v":{"$error":"#NAME?"}},null,{"$f":"'BCE Inc. Seg Info HIST p5'!E52","v":{"$error":"#NAME?"}},{"$f":"I36/I10","v":3.9525691699604744E-2},null,null,{"$f":"((ROUND(I37,3)-ROUND(H37,3))*100)","v":{"$error":"#NAME?"}}]
["Total",{"$f":"'BCE Inc. Seg Info HIST p5'!G53","v":{"$error":"#NAME?"}},{"$f":"'BCE Inc. Seg Info HIST p5'!N53","v":1466},null,{"$f":"C38-B38","v":{"$error":"#NAME?"}},{"$f":"IF(OR((+E38/(ABS(C38)))>100%,(+E38/(ABS(C38)))<-100%),\"n.m.\",(+E38/(ABS(C38))))","v":{"$error":"#NAME?"}},null,{"$f":"'BCE Inc. Seg Info HIST p5'!E53","v":{"$error":"#NAME?"}},{"$f":"'BCE Inc. Seg Info HIST p5'!O53+'BCE Inc. Seg Info HIST p5'!P53+'BCE Inc. Seg Info HIST p5'!Q53+'BCE Inc. Seg Info HIST p5'!N53","v":4852},null,{"$f":"I38-H38","v":{"$error":"#NAME?"}},{"$f":"IF(OR((+K38/(ABS(I38)))>100%,(+K38/(ABS(I38)))<-100%),\"n.m.\",(+K38/(ABS(I38))))","v":{"$error":"#NAME?"}}]
["Capital intensity ",{"$f":"'BCE Inc. Seg Info HIST p5'!G54","v":{"$error":"#NAME?"}},{"$f":"'BCE Inc. Seg Info HIST p5'!N54","v":0.23610887421484941},null,null,{"$f":"((ROUND(C39,3)-ROUND(B39,3))*100)","v":{"$error":"#NAME?"}},null,{"$f":"'BCE Inc. Seg Info HIST p5'!E54","v":{"$error":"#NAME?"}},{"$f":"I38/I12","v":0.20691713932363853},null,null,{"$f":"((ROUND(I39,3)-ROUND(H39,3))*100)","v":{"$error":"#NAME?"}}]
[]
[]
["(A) Capital intensity is defined as capital expenditures divided by operating revenues."]
["n.m. : not meaningful"]

{"sheet":"Bell Wireless Summary p6","index":13,"n_rows":45,"n_cols":14,"rows_kept":45,"cut":false,"hidden":true,"merged":[[43,2,43,13],[44,2,44,15]]}
[]
[null,null,null,null,null,null,null,null,null,null,null,null,null,"Bell Wireless (1) (2)"]
[]
[]
[null,null,null,"Q4",null,"Q4",null,null,null,"TOTAL",null,"TOTAL"]
[null,"(In millions of Canadian dollars, except where otherwise indicated) (unaudited)",null,2022,null,2021,null,"% change",null,2022,null,2021,null,"% change"]
[null,"Bell Wireless",null,null,null," ",null,null,null,null,null," "]
[null,"Operating revenues"]
[null,"External service revenues",null,{"$f":"'Bell Wireless HIST p7'!F18","v":{"$error":"#NAME?"}},null,{"$f":"'Bell Wireless HIST p7'!M18","v":1641},null,{"$f":"IF(OR(((ABS(D9-F9)/F9))>100%,((ABS(D9-F9)/F9))<-100%),\"n.m.\",((D9-F9)/ABS(F9)))","v":{"$error":"#NAME?"}},null,{"$f":"'Bell Wireless HIST p7'!D18","v":{"$error":"#NAME?"}},null,{"$f":"'Bell Wireless HIST p7'!N18+'Bell Wireless HIST p7'!O18+'Bell Wireless HIST p7'!P18+'Bell Wireless HIST p7'!M18","v":6355},null,{"$f":"IF(OR(((ABS(J9-L9)/L9))>100%,((ABS(J9-L9)/L9))<-100%),\"n.m.\",((J9-L9)/ABS(L9)))","v":{"$error":"#NAME?"}}]
[null,"Inter-segment service revenues",null,{"$f":"'Bell Wireless HIST p7'!F19","v":{"$error":"#NAME?"}},null,{"$f":"'Bell Wireless HIST p7'!M19","v":11},null,{"$f":"IF(OR(((ABS(D10-F10)/F10))>100%,((ABS(D10-F10)/F10))<-100%),\"n.m.\",((D10-F10)/ABS(F10)))","v":{"$error":"#NAME?"}},null,{"$f":"'Bell Wireless HIST p7'!D19","v":{"$error":"#NAME?"}},null,{"$f":"'Bell Wireless HIST p7'!N19+'Bell Wireless HIST p7'!O19+'Bell Wireless HIST p7'!P19+'Bell Wireless HIST p7'!M19","v":45},null,{"$f":"IF(OR(((ABS(J10-L10)/L10))>100%,((ABS(J10-L10)/L10))<-100%),\"n.m.\",((J10-L10)/ABS(L10)))","v":{"$error":"#NAME?"}}]
[null,"Operating service revenues",null,{"$f":"'Bell Wireless HIST p7'!F20","v":{"$error":"#NAME?"}},null,{"$f":"'Bell Wireless HIST p7'!M20","v":1652},null,{"$f":"IF(OR(((ABS(D11-F11)/F11))>100%,((ABS(D11-F11)/F11))<-100%),\"n.m.\",((D11-F11)/ABS(F11)))","v":{"$error":"#NAME?"}},null,{"$f":"'Bell Wireless HIST p7'!D20","v":{"$error":"#NAME?"}},null,{"$f":"'Bell Wireless HIST p7'!N20+'Bell Wireless HIST p7'!O20+'Bell Wireless HIST p7'!P20+'Bell Wireless HIST p7'!M20","v":6400},null,{"$f":"IF(OR(((ABS(J11-L11)/L11))>100%,((ABS(J11-L11)/L11))<-100%),\"n.m.\",((J11-L11)/ABS(L11)))","v":{"$error":"#NAME?"}}]
[null,"External product revenues",null,{"$f":"'Bell Wireless HIST p7'!F21","v":{"$error":"#NAME?"}},null,{"$f":"'Bell Wireless HIST p7'!M21","v":821},null,{"$error":"#NAME?"},null,{"$f":"'Bell Wireless HIST p7'!D21","v":{"$error":"#NAME?"}},null,{"$f":"'Bell Wireless HIST p7'!N21+'Bell Wireless HIST p7'!O21+'Bell Wireless HIST p7'!P21+'Bell Wireless HIST p7'!M21","v":2593},null,{"$error":"#NAME?"}]
[null,"Inter-segment product revenues",null,{"$f":"'Bell Wireless HIST p7'!F22","v":{"$error":"#NAME?"}},null,{"$f":"'Bell Wireless HIST p7'!M22","v":2},null,0,null,{"$f":"'Bell Wireless HIST p7'!D22","v":{"$error":"#NAME?"}},null,{"$f":"'Bell Wireless HIST p7'!N22+'Bell Wireless HIST p7'!O22+'Bell Wireless HIST p7'!P22+'Bell Wireless HIST p7'!M22","v":6},null,{"$error":"#NAME?"}]
[null,"Operating product revenues",null,{"$f":"'Bell Wireless HIST p7'!F23","v":{"$error":"#NAME?"}},null,{"$f":"'Bell Wireless HIST p7'!M23","v":823},null,{"$error":"#NAME?"},null,{"$f":"'Bell Wireless HIST p7'!D23","v":{"$error":"#NAME?"}},null,{"$f":"'Bell Wireless HIST p7'!N23+'Bell Wireless HIST p7'!O23+'Bell Wireless HIST p7'!P23+'Bell Wireless HIST p7'!M23","v":2599},null,{"$error":"#NAME?"}]
[null,"Total external revenues ",null,{"$f":"'Bell Wireless HIST p7'!F24","v":{"$error":"#NAME?"}},null,{"$f":"'Bell Wireless HIST p7'!M24","v":2462},null,{"$error":"#NAME?"},null,{"$f":"J9+J12","v":{"$error":"#NAME?"}},null,{"$f":"L9+L12","v":8948},null,{"$error":"#NAME?"}]
[null,"Total operating revenues",null,{"$f":"'Bell Wireless HIST p7'!F26","v":{"$error":"#NAME?"}},null,{"$f":"'Bell Wireless HIST p7'!M26","v":2475},null,{"$error":"#NAME?"},null,{"$f":"'Bell Wireless HIST p7'!D26","v":{"$error":"#NAME?"}},null,{"$f":"'Bell Wireless HIST p7'!N26+'Bell Wireless HIST p7'!O26+'Bell Wireless HIST p7'!P26+'Bell Wireless HIST p7'!M26","v":8999},null,{"$error":"#NAME?"}]
[null,"Operating costs",null,{"$f":"'Bell Wireless HIST p7'!F27","v":{"$error":"#NAME?"}},null,{"$f":"'Bell Wireless HIST p7'!M27","v":-1524},null,{"$error":"#NAME?"},null,{"$f":"'Bell Wireless HIST p7'!D27","v":{"$error":"#NAME?"}},null,{"$f":"'Bell Wireless HIST p7'!N27+'Bell Wireless HIST p7'!O27+'Bell Wireless HIST p7'!P27+'Bell Wireless HIST p7'!M27","v":-5146},null,{"$error":"#NAME?"}]
[null,"Adjusted EBITDA",null,{"$f":"'Bell Wireless HIST p7'!F28","v":{"$error":"#NAME?"}},null,{"$f":"'Bell Wireless HIST p7'!M28","v":951},null,{"$error":"#NAME?"},null,{"$f":"'Bell Wireless HIST p7'!D28","v":{"$error":"#NAME?"}},null,{"$f":"'Bell Wireless HIST p7'!N28+'Bell Wireless HIST p7'!O28+'Bell Wireless HIST p7'!P28+'Bell Wireless HIST p7'!M28","v":3853},null,{"$error":"#NAME?"}]
[null,"Adjusted EBITDA margin ",null,{"$f":"'Bell Wireless HIST p7'!F29","v":{"$error":"#NAME?"}},null,{"$f":"'Bell Wireless HIST p7'!M29","v":0.38424242424242422},null,{"$f":"((ROUND(D19,3)-ROUND(F19,3))*100)","v":{"$error":"#NAME?"}},null,{"$f":"'Bell Wireless HIST p7'!D29","v":{"$error":"#NAME?"}},null,{"$f":"L18/L16","v":0.42815868429825538},null,{"$f":"((ROUND(J19,3)-ROUND(L19,3))*100)","v":{"$error":"#NAME?"}}]
[null,"Capital expenditures ",null,{"$f":"'Bell Wireless HIST p7'!F33","v":308},null,{"$f":"'Bell Wireless HIST p7'!M33","v":273},null,{"$f":"IF(OR(((ABS(F20-D20)/F20))>=100%,((ABS(F20-D20)/F20))<=-100%),\"n.m.\",((F20-D20)/ABS(F20)))","v":-0.12820512820512819},null,{"$f":"'Bell Wireless HIST p7'!D33","v":1084},null,{"$f":"'Bell Wireless HIST p7'!N33+'Bell Wireless HIST p7'!O33+'Bell Wireless HIST p7'!P33+'Bell Wireless HIST p7'!M33","v":1120},null,{"$f":"IF(OR(((ABS(L20-J20)/L20))>=100%,((ABS(L20-J20)/L20))<=-100%),\"n.m.\",((L20-J20)/ABS(L20)))","v":3.214285714285714E-2}]
[null,"Capital intensity ",null,{"$f":"'Bell Wireless HIST p7'!F34","v":{"$error":"#NAME?"}},null,{"$f":"'Bell Wireless HIST p7'!M34","v":0.11030303030303031},null,{"$f":"((ROUND(F21,3)-ROUND(D21,3))*100)","v":{"$error":"#NAME?"}},null,{"$f":"'Bell Wireless HIST p7'!D34","v":{"$error":"#NAME?"}},null,{"$f":"L20/L16","v":0.12445827314146016},null,{"$f":"((ROUND(L21,3)-ROUND(J21,3))*100)","v":{"$error":"#NAME?"}}]
[]
[null,"Mobile phone subscribers(4)"]
[null,"Gross subscriber activations",null,{"$f":"'Bell Wireless HIST p7'!F37","v":605034},null,{"$f":"'Bell Wireless HIST p7'!M37","v":495076},null,{"$f":"IF(OR(((ABS(D24-F24)/F24))>100%,((ABS(D24-F24)/F24))<-100%),\"n.m.\",((D24-F24)/ABS(F24)))","v":0.22210327303282729},null,{"$f":"'Bell Wireless HIST p7'!D37","v":1953912},null,{"$f":"'Bell Wireless HIST p7'!N37+'Bell Wireless HIST p7'!O37+'Bell Wireless HIST p7'!P37+'Bell Wireless HIST p7'!M37","v":1653771},null,{"$f":"IF(OR(((ABS(J24-L24)/L24))>100%,((ABS(J24-L24)/L24))<-100%),\"n.m.\",((J24-L24)/ABS(L24)))","v":0.18148885184224417}]
[null,"Postpaid",null,{"$f":"'Bell Wireless HIST p7'!F38","v":467294},null,{"$f":"'Bell Wireless HIST p7'!M38","v":373621},null,0.25071663530690191,null,{"$f":"'Bell Wireless HIST p7'!D38","v":1355772},null,{"$f":"'Bell Wireless HIST p7'!N38+'Bell Wireless HIST p7'!O38+'Bell Wireless HIST p7'!P38+'Bell Wireless HIST p7'!M38","v":1201659},null,0.12825019410664756]
[null,"Prepaid",null,{"$f":"'Bell Wireless HIST p7'!F39","v":137740},null,{"$f":"'Bell Wireless HIST p7'!M39","v":121455},null,0.13408258202626488,null,{"$f":"'Bell Wireless HIST p7'!D39","v":598140},null,{"$f":"'Bell Wireless HIST p7'!N39+'Bell Wireless HIST p7'!O39+'Bell Wireless HIST p7'!P39+'Bell Wireless HIST p7'!M39","v":452112},null,0.32299076335067417]
[null,"Net subscriber activations (losses)",null,{"$f":"'Bell Wireless HIST p7'!F40","v":122621},null,{"$f":"'Bell Wireless HIST p7'!M40","v":109726},null,0.11752000437453293,null,{"$f":"'Bell Wireless HIST p7'!D40","v":489901},null,{"$f":"'Bell Wireless HIST p7'!N40+'Bell Wireless HIST p7'!O40+'Bell Wireless HIST p7'!P40+'Bell Wireless HIST p7'!M40","v":294842},null,0.6615712822460843]
[null,"Postpaid",null,{"$f":"'Bell Wireless HIST p7'!F41","v":154617},null,{"$f":"'Bell Wireless HIST p7'!M41","v":109527},null,0.41167931195047797,null,{"$f":"'Bell Wireless HIST p7'!D41","v":439842},null,{"$f":"'Bell Wireless HIST p7'!N41+'Bell Wireless HIST p7'!O41+'Bell Wireless HIST p7'!P41+'Bell Wireless HIST p7'!M41","v":301706},null,0.45784969473593501]
[null,"Prepaid",null,{"$f":"'Bell Wireless HIST p7'!F42","v":-31996},null,{"$f":"'Bell Wireless HIST p7'!M42","v":199},null,"n.m.",null,{"$f":"'Bell Wireless HIST p7'!D42","v":50059},null,{"$f":"'Bell Wireless HIST p7'!N42+'Bell Wireless HIST p7'!O42+'Bell Wireless HIST p7'!P42+'Bell Wireless HIST p7'!M42","v":-6864},null,"n.m."]
[null,"Subscribers end of period (EOP)",null,{"$f":"'Bell Wireless HIST p7'!F43","v":9949086},null,{"$f":"'Bell Wireless HIST p7'!M43","v":9459185.1253664009},null,5.179102302584683E-2,null,{"$f":"'Bell Wireless HIST p7'!D43","v":9949086},null,{"$f":"F30","v":9459185.1253664009},null,5.179102302584683E-2]
[null,"Postpaid",null,{"$f":"'Bell Wireless HIST p7'!F44","v":9069887},null,{"$f":"'Bell Wireless HIST p7'!M44","v":8630045.2253664006},null,5.0966334839215789E-2,null,{"$f":"'Bell Wireless HIST p7'!D44","v":9069887},null,{"$f":"F31","v":8630045.2253664006},null,5.0966334839215789E-2]
[null,"Prepaid",null,{"$f":"'Bell Wireless HIST p7'!F45","v":879199},null,{"$f":"'Bell Wireless HIST p7'!M45","v":829139.9},null,6.0374732900925376E-2,null,{"$f":"'Bell Wireless HIST p7'!D45","v":879199},null,829139.9,null,6.0374732900925376E-2]
[null,"Blended average revenue per user (ARPU) ($/month)(A)(4)",null,{"$f":"'Bell Wireless HIST p7'!F46","v":58.88},null,{"$f":"'Bell Wireless HIST p7'!M46","v":58.608488800000003},null,{"$f":"IF(OR(((ABS(D33-F33)/F33))>100%,((ABS(D33-F33)/F33))<-100%),\"n.m.\",((D33-F33)/ABS(F33)))","v":4.6326258458313811E-3},null,{"$f":"'Bell Wireless HIST p7'!D46","v":59.3},null,{"$f":"'Bell Wireless HIST p7'!K46","v":57.664423800000002},null,2.8363696231019923E-2]
[]
[null,"Blended churn (%) (average per month)(4)",null,{"$f":"'Bell Wireless HIST p7'!F48","v":1.6299999999999999E-2},null,{"$f":"'Bell Wireless HIST p7'!M48","v":1.37295E-2},null,{"$f":"((ROUND(F35,4)-ROUND(D35,4))*100)","v":-0.25999999999999979},null,{"$f":"'Bell Wireless HIST p7'!D48","v":1.2699999999999999E-2},null,{"$f":"'Bell Wireless HIST p7'!K48","v":1.23074E-2},null,{"$f":"((ROUND(L35,4)-ROUND(J35,4))*100)","v":-3.9999999999999931E-2}]
[null,"Postpaid",null,{"$f":"'Bell Wireless HIST p7'!F49","v":1.2200000000000001E-2},null,{"$f":"'Bell Wireless HIST p7'!M49","v":1.0782E-2},null,{"$f":"((ROUND(F36,4)-ROUND(D36,4))*100)","v":-0.14000000000000001},null,{"$f":"'Bell Wireless HIST p7'!D49","v":9.1999999999999998E-3},null,{"$f":"'Bell Wireless HIST p7'!K49","v":9.3212E-3},null,{"$f":"((ROUND(L36,4)-ROUND(J36,4))*100)","v":9.9999999999999395E-3}]
[null,"Prepaid",null,{"$f":"'Bell Wireless HIST p7'!F50","v":5.74E-2},null,{"$f":"'Bell Wireless HIST p7'!M50","v":4.4151200000000002E-2},null,-1.3199999999999996,null,{"$f":"'Bell Wireless HIST p7'!D50","v":4.8500000000000001E-2},null,{"$f":"'Bell Wireless HIST p7'!K50","v":4.3075099999999998E-2},null,-0.54000000000000026]
[null,"Mobile connected device subscribers(4)"]
[null,"Net subscriber activations",null,{"$f":"'Bell Wireless HIST p7'!F52","v":104447},null,{"$f":"'Bell Wireless HIST p7'!M52","v":38998},null,{"$f":"IF(OR(((ABS(D39-F39)/F39))>100%,((ABS(D39-F39)/F39))<-100%),\"n.m.\",((D39-F39)/ABS(F39)))","v":"n.m."},null,{"$f":"'Bell Wireless HIST p7'!D52","v":202024},null,{"$f":"'Bell Wireless HIST p7'!N52+'Bell Wireless HIST p7'!O52+'Bell Wireless HIST p7'!P52+'Bell Wireless HIST p7'!M52","v":193641},null,{"$f":"IF(OR(((ABS(J39-L39)/L39))>100%,((ABS(J39-L39)/L39))<-100%),\"n.m.\",((J39-L39)/ABS(L39)))","v":4.3291451707024857E-2}]
[null,"Subscribers EOP",null,{"$f":"'Bell Wireless HIST p7'!F53","v":2451818},null,{"$f":"'Bell Wireless HIST p7'!M53","v":2249794},null,8.9796665828071373E-2,null,{"$f":"'Bell Wireless HIST p7'!D53","v":2451818},null,{"$f":"'Bell Wireless HIST p7'!K53","v":2249794},null,8.9796665828071373E-2]
[]
[null,"n.m. : not meaningful"]
[]
[null,"(A)","Mobile phone blended ARPU is calculated by dividing wireless operating service revenues by the average mobile phone subscriber base for the specified period and is expressed as a dollar unit per month.\n"]
[null,"(B)","In Q3 2022, as a result of the acquisition of Xplore Mobile and other related companies, our retail mobility subscriber base increased by XXX,XXX subscribers"]

{"sheet":"Bell Wireless HIST p7","index":14,"n_rows":61,"n_cols":19,"rows_kept":61,"cut":false,"hidden":true,"merged":[[54,2,54,15],[14,1,14,2],[55,2,55,15]]}
["CORPORATE","METRICS"]
["ACTUAL","GLOBAL in Metrics"]
["ALL_DS","ACTUAL","All Data Sources"]
["All Posting Levels","ALL CUSTOMERS"]
["Canadian Dollar","All Data Sources"]
["All Trading Partners","ALL CHANNELS"]
["Year To Date","ALL NETWORKS"]
["Quarter to date","ALL_POST_PRE",null,null,null,null,null,null,null,null,null,null,null,null,null,null,null,{"$f":" _xll.EPMOlapMemberO(\"[POST_PREPAID].[PARENTH1].[PREPAID]\",\"\",\"PREPAID\",\"\",\"000\")","v":{"$error":"#NAME?"}}]
[null,"WIRELESS_PROD"]
["WRLESS","ALL REGIONS"]
[null,"Year To Date",null,"2022.Q4 - 2022.Q4"]
["TP_IC - All Intercos",null,null,null,null,null,null,null,null,null,null,null,null,null,null,"Bell Wireless - Historical Trend (2)"]
["TP_EXTERNAL - External (Third Party)"]
[]
[null,"(In millions of Canadian dollars, except where otherwise indicated) (unaudited)",null,"TOTAL\n2022",null,"Q4 22","Q3 22","Q2 22","Q1 22",null,"TOTAL\n2021",null,"Q4 21","Q3 21","Q2 21","Q1 21",null,"CY CHECK","PY CHECK"]
[null,"Bell Wireless"]
[null,"Operating revenues"]
["T401010","External service revenues",null,{"$f":"(ROUND(_xll.EPMRetrieveData($A$1,$A$18,$A$10,$A$2,$A$3,$A$4,$A$5,$A$13,$A$7,D11)/1000000,0))","v":{"$error":"#NAME?"}},null,{"$f":"D18-G18-H18-I18","v":{"$error":"#NAME?"}},1759,1692,1635,null,6355,null,1641,1642,1569,1503,null,{"$f":"SUM(F18:I18)=D18","v":{"$error":"#NAME?"}},{"$f":"P18+O18+N18+M18=K18","v":true}]
[null,"Inter-segment service revenues",null,{"$f":"((ROUND(_xll.EPMRetrieveData($A$1,$A$18,$A$10,$A$2,$A$3,$A$4,$A$5,$A$12,$A$7,D11)/1000000,0)))","v":{"$error":"#NAME?"}},null,{"$f":"D19-G19-H19-I19","v":{"$error":"#NAME?"}},10,11,11,null,45,null,11,12,11,11,null,{"$f":"SUM(F19:I19)=D19","v":{"$error":"#NAME?"}},{"$f":"P19+O19+N19+M19=K19","v":true}]
[null,"Operating service revenues",null,{"$f":"D19+D18","v":{"$error":"#NAME?"}},null,{"$f":"D20-G20-H20-I20","v":{"$error":"#NAME?"}},1769,1703,1646,null,6400,null,1652,1654,1580,1514,null,{"$error":"#NAME?"},true]
["LC-4261100 - Wireline Product Revenue","External product revenues",null,{"$f":"(ROUND(_xll.EPMRetrieveData($A$1,$A$22,$A$10,$A$2,$A$3,$A$4,$A$5,$A$13,$A$7,D11)/1000000,0))","v":{"$error":"#NAME?"}},null,{"$error":"#NAME?"},692,542,563,null,2593,null,821,642,546,584,null,{"$error":"#NAME?"},true]
["t401040","Inter-segment product revenues",null,{"$f":"ROUND(_xll.EPMRetrieveData($A$1,$A$22,$A$10,$A$2,$A$3,$A$4,$A$5,$A$12,$A$7,D11)/1000000,0)","v":{"$error":"#NAME?"}},null,{"$f":"D22-G22-H22-I22","v":{"$error":"#NAME?"}},5,1,1,null,6,null,2,0,2,2,null,{"$error":"#NAME?"},true]
["T401000","Operating product revenues",null,{"$f":"D22+D21","v":{"$error":"#NAME?"}},null,{"$error":"#NAME?"},697,543,564,{"$f":"J22+J21","v":0},2599,null,823,642,548,586,null,{"$error":"#NAME?"},true]
["LC-4999920 - Hardware - Intercompany","Total external revenues ",null,{"$f":"ROUND(_xll.EPMRetrieveData($A$1,$A$23,$A$10,$A$2,$A$3,$A$4,$A$5,$A$13,$A$7,D11)/1000000,0)","v":{"$error":"#NAME?"}},null,{"$error":"#NAME?"},2451,2234,2198,null,8948,null,2462,2284,2115,2087,null,{"$error":"#NAME?"},true]
[null,"Inter-segment",null,null,null,null,0,0,null,null,null,null,null,0,0,null,null,true,true]
["t401070","Total operating revenues",null,{"$f":"'BCE Inc. Seg Info HIST p5'!E23","v":{"$error":"#NAME?"}},null,{"$error":"#NAME?"},2466,2246,2210,null,8999,null,2475,2296,2128,2100,null,{"$error":"#NAME?"},true]
[null,"Operating costs",null,{"$f":"'BCE Inc. Seg Info HIST p5'!E30","v":{"$error":"#NAME?"}},null,{"$error":"#NAME?"},-1377,-1197,-1201,null,-5146,null,-1524,-1286,-1159,-1177,null,{"$error":"#NAME?"},true]
[null,"Adjusted EBITDA ",null,{"$f":"'BCE Inc. Seg Info HIST p5'!E37","v":{"$error":"#NAME?"}},null,{"$error":"#NAME?"},1089,1049,1009,null,3853,null,951,1010,969,923,null,{"$error":"#NAME?"},true]
[null,"Adjusted EBITDA margin ",null,{"$f":"D28/D26","v":{"$error":"#NAME?"}},null,{"$f":"F28/F26","v":{"$error":"#NAME?"}},0.442,0.4670525378450579,0.45656108597285067,null,0.42815868429825538,null,0.38424242424242422,0.43989547038327526,0.45535714285714285,0.43952380952380954]
[null,"Adjusted EBITDA margin (External service revenues)",null,null,null,null,null,null,null,null,null,null,null,null,null,null,null,true,true]
[null,"Adjusted EBITDA margin (Operating service revenues)",null,null,null,null,null,null,null,null,null,null,null,null,null,null,null,true,true]
[]
[null,"Capital expenditures",null,{"$f":"'BCE Inc. Seg Info HIST p5'!E47","v":1084},null,{"$f":"'BCE Inc. Seg Info HIST p5'!G47","v":308},248,280,{"$f":"'BCE Inc. Seg Info HIST p5'!J47","v":248},{"$f":"'BCE Inc. Seg Info HIST p5'!K47","v":0},{"$f":"'BCE Inc. Seg Info HIST p5'!L47","v":1120},{"$f":"'BCE Inc. Seg Info HIST p5'!M47","v":0},{"$f":"'BCE Inc. Seg Info HIST p5'!N47","v":273},{"$f":"'BCE Inc. Seg Info HIST p5'!O47","v":255},{"$f":"'BCE Inc. Seg Info HIST p5'!P47","v":306},{"$f":"'BCE Inc. Seg Info HIST p5'!Q47","v":286},null,true,true]
[null,"Capital intensity ",null,{"$f":"'BCE Inc. Seg Info HIST p5'!E48","v":{"$error":"#NAME?"}},null,{"$f":"'BCE Inc. Seg Info HIST p5'!G48","v":{"$error":"#NAME?"}},0.10056772100567721,0.1246660730186999,{"$f":"'BCE Inc. Seg Info HIST p5'!J48","v":0.11221719457013575},{"$f":"'BCE Inc. Seg Info HIST p5'!K48","v":{"$error":"#DIV/0!"}},{"$f":"'BCE Inc. Seg Info HIST p5'!L48","v":0.12445827314146016},{"$f":"'BCE Inc. Seg Info HIST p5'!M48","v":{"$error":"#DIV/0!"}},{"$f":"'BCE Inc. Seg Info HIST p5'!N48","v":0.11030303030303031},{"$f":"'BCE Inc. Seg Info HIST p5'!O48","v":0.11106271777003485},{"$f":"'BCE Inc. Seg Info HIST p5'!P48","v":0.14379699248120301},{"$f":"'BCE Inc. Seg Info HIST p5'!Q48","v":0.1361904761904762}]
[]
[null,"Mobile phone subscribers"]
[null,"Gross subscriber activations",null,1953912,null,{"$f":"D37-G37-H37-I37","v":605034},583700,415270,349908,null,1653771,null,495076,470165,348403,340127,null,true,true]
[null,"Postpaid",null,1355772,null,{"$f":"D38-G38-H38-I38","v":467294},391165,266600,230713,null,1201659,null,373621,336328,242720,248990,null,true,true]
[null,"Prepaid",null,598140,null,{"$f":"D39-G39-H39-I39","v":137740},192535,148670,119195,null,452112,null,121455,133837,105683,91137,null,{"$f":"SUM(F39:I39)=D39","v":true},true]
[null,"Net subscriber activations (losses)",null,489901,null,122621,224343,110761,32176,null,294842,null,109726,136464,46247,2405,null,true,true]
[null,"Postpaid",null,439842,null,154617,167798,83197,34230,null,301706,null,109527,114821,44433,32925,null,true,true]
[null,"Prepaid",null,50059,null,-31996,56545,27564,-2054,null,-6864,null,199,21643,1814,-30520,null,true,true]
[null,"Subscribers EOP",null,9949086,null,{"$f":"D43","v":9949086},9826465.1253664009,9602122.1253664009,9491361.1253664009,null,9459185.1253664009,null,9459185.1253664009,9349459.1253664009,9212995.1253664009,9166748,null,false]
[null,"Postpaid",null,9069887,null,{"$f":"D44","v":9069887},8915270.2253664006,8747472.2253664006,8664275.2253664006,null,8630045.2253664006,null,8630045.2253664006,8520518.2253664006,8405697.2253664006,8361264,null,false]
[null,"Prepaid",null,879199,null,{"$f":"D45","v":879199},911194.9,854649.9,827085.9,null,829139.9,null,829139.9,828940.9,807297.9,805484,null,false]
[null,"Blended ARPU ($/month)",null,59.3,null,58.88,60.76,59.5431934,57.983489400000003,null,57.664423800000002,null,58.608488800000003,59.466230600000003,57.360305699999998,55.174383300000002]
[null,null,null,null,null,null,null,null,null,null,null,null,null,null,null,null,null,true,true]
[null,"Blended churn (%) (average per month)",null,1.2699999999999999E-2,null,1.6299999999999999E-2,1.24E-2,1.0737500000000001E-2,1.12421E-2,null,1.23074E-2,null,1.37295E-2,1.20897E-2,1.1043499999999999E-2,1.23E-2]
[null,"Postpaid",null,9.1999999999999998E-3,null,1.2200000000000001E-2,8.9999999999999993E-3,7.5217000000000001E-3,7.9129000000000005E-3,null,9.3212E-3,null,1.0782E-2,9.2504000000000006E-3,8.2737000000000002E-3,8.8999999999999999E-3]
[null,"Prepaid",null,4.8500000000000001E-2,null,5.74E-2,4.58E-2,4.4090699999999997E-2,4.6051099999999998E-2,null,4.3075099999999998E-2,null,4.4151200000000002E-2,4.1468999999999999E-2,3.9803400000000003E-2,4.6800000000000001E-2]
[null,"Mobile connected device subscribers"]
[null,"Net subscriber activations (losses)",null,202024,null,{"$f":"D52-G52-H52-I52","v":104447},49044,-344,48877,null,193641,null,38998,33035,47449,74159,null,true,true]
[null,"Subscribers EOP",null,2451818,null,{"$f":"D53","v":2451818},2347371,2298327,2298671,null,2249794,null,2249794,2210796,2177761,2130312]
[]
[null,"(A)","In Q3 2022, as a result of the acquisition of Xplore Mobile and other related companies, our retail mobility subscriber base increased by XXX,XXX subscribers"]
[]
[null,null,"Operating service revenues",{"$f":"SUM(D18:D19)=D20","v":{"$error":"#NAME?"}},null,{"$f":"SUM(F18:F19)=F20","v":{"$error":"#NAME?"}},{"$f":"SUM(G18:G19)=G20","v":true},{"$f":"SUM(H18:H19)=H20","v":true},{"$f":"SUM(I18:I19)=I20","v":true},null,true,null,true,true,true,true]
[null,null,"Operating product revenues",{"$f":"(D21+D22)=D23","v":{"$error":"#NAME?"}},null,{"$f":"(F21+F22)=F23","v":{"$error":"#NAME?"}},{"$f":"(G21+G22)=G23","v":true},{"$f":"(H21+H22)=H23","v":true},{"$f":"(I21+I22)=I23","v":true},null,true,null,true,true,true,true]
[null,null,"Total external revenues ",{"$f":"(D18+D21)=D24","v":{"$error":"#NAME?"}},null,{"$f":"(F18+F21)=F24","v":{"$error":"#NAME?"}},{"$f":"(G18+G21)=G24","v":true},{"$f":"(H18+H21)=H24","v":true},{"$f":"(I18+I21)=I24","v":true},null,true,null,true,true,true,true]
[null,null,"Total operating revenues",{"$f":"(D20+D23)=D26","v":{"$error":"#NAME?"}},null,{"$f":"(F20+F23)=F26","v":{"$error":"#NAME?"}},{"$f":"(G20+G23)=G26","v":true},{"$f":"(H20+H23)=H26","v":true},{"$f":"(I20+I23)=I26","v":true},null,true,null,true,true,true,true]
[null,null,"Adjusted EBITDA ",{"$f":"(D26+D27)=D28","v":{"$error":"#NAME?"}},null,{"$f":"(F26+F27)=F28","v":{"$error":"#NAME?"}},{"$f":"(G26+G27)=G28","v":true},{"$f":"(H26+H27)=H28","v":true},{"$f":"(I26+I27)=I28","v":true},null,true,null,true,true,true,true]

{"sheet":"Bell Wireline Summary p8","index":15,"n_rows":44,"n_cols":13,"rows_kept":44,"cut":false,"hidden":true,"merged":[[42,1,42,12],[43,1,44,12],[41,0,41,11]]}
[]
[null,null,null,null,null,null,null,null,null,null,null,null,"Bell Wireline (1) (2)"]
[]
[]
[null,null,"Q4",null,"Q4",null,null,null,"TOTAL",null,"TOTAL"]
["(In millions of Canadian dollars, except where otherwise indicated) (unaudited)",null,2022,null,2021,null,"% change",null,2022,null,2021,null,"% change"]
["Bell Wireline"]
["Operating revenues"]
["Data ",null,{"$f":"'Bell Wireline HIST p9'!G24","v":{"$error":"#NAME?"}},null,{"$f":"'Bell Wireline HIST p9'!N24","v":1986},null,{"$f":"IF(OR(((ABS(C9-E9)/E9))>100%,((ABS(C9-E9)/E9))<-100%),\"n.m.\",((C9-E9)/ABS(E9)))","v":{"$error":"#NAME?"}},{"$f":"(C9-F9)/F9","v":{"$error":"#NAME?"}},{"$f":"'Bell Wireline HIST p9'!E24","v":{"$error":"#NAME?"}},null,{"$f":"'Bell Wireline HIST p9'!O24+'Bell Wireline HIST p9'!P24+'Bell Wireline HIST p9'!Q24+'Bell Wireline HIST p9'!N24","v":7871},null,{"$f":"IF(OR(((ABS(I9-K9)/K9))>100%,((ABS(I9-K9)/K9))<-100%),\"n.m.\",((I9-K9)/ABS(K9)))","v":{"$error":"#NAME?"}}]
["Voice",null,{"$f":"'Bell Wireline HIST p9'!G25","v":{"$error":"#NAME?"}},null,{"$f":"'Bell Wireline HIST p9'!N25","v":779},null,{"$f":"IF(OR(((ABS(C10-E10)/E10))>100%,((ABS(C10-E10)/E10))<-100%),\"n.m.\",((C10-E10)/ABS(E10)))","v":{"$error":"#NAME?"}},{"$error":"#NAME?"},{"$f":"'Bell Wireline HIST p9'!E25","v":{"$error":"#NAME?"}},null,{"$f":"'Bell Wireline HIST p9'!O25+'Bell Wireline HIST p9'!P25+'Bell Wireline HIST p9'!Q25+'Bell Wireline HIST p9'!N25","v":3154},null,{"$f":"IF(OR(((ABS(I10-K10)/K10))>100%,((ABS(I10-K10)/K10))<-100%),\"n.m.\",((I10-K10)/ABS(K10)))","v":{"$error":"#NAME?"}}]
["Other services",null,{"$f":"'Bell Wireline HIST p9'!G26","v":{"$error":"#NAME?"}},null,{"$f":"'Bell Wireline HIST p9'!N26","v":75},null,{"$f":"IF(OR(((ABS(C11-E11)/E11))>100%,((ABS(C11-E11)/E11))<-100%),\"n.m.\",((C11-E11)/ABS(E11)))","v":{"$error":"#NAME?"}},{"$error":"#NAME?"},{"$f":"'Bell Wireline HIST p9'!E26","v":{"$error":"#NAME?"}},null,{"$f":"'Bell Wireline HIST p9'!O26+'Bell Wireline HIST p9'!P26+'Bell Wireline HIST p9'!Q26+'Bell Wireline HIST p9'!N26","v":289},null,{"$f":"IF(OR(((ABS(I11-K11)/K11))>100%,((ABS(I11-K11)/K11))<-100%),\"n.m.\",((I11-K11)/ABS(K11)))","v":{"$error":"#NAME?"}}]
["External service revenues",null,{"$f":"'Bell Wireline HIST p9'!G27","v":{"$error":"#NAME?"}},null,{"$f":"'Bell Wireline HIST p9'!N27","v":2840},null,{"$f":"IF(OR(((ABS(C12-E12)/E12))>100%,((ABS(C12-E12)/E12))<-100%),\"n.m.\",((C12-E12)/ABS(E12)))","v":{"$error":"#NAME?"}},{"$error":"#NAME?"},{"$f":"'Bell Wireline HIST p9'!E27","v":{"$error":"#NAME?"}},null,{"$f":"'Bell Wireline HIST p9'!O27+'Bell Wireline HIST p9'!P27+'Bell Wireline HIST p9'!Q27+'Bell Wireline HIST p9'!N27","v":11314},null,{"$f":"IF(OR(((ABS(I12-K12)/K12))>100%,((ABS(I12-K12)/K12))<-100%),\"n.m.\",((I12-K12)/ABS(K12)))","v":{"$error":"#NAME?"}}]
["Inter-segment service revenues",null,{"$f":"'Bell Wireline HIST p9'!G28","v":{"$error":"#NAME?"}},null,{"$f":"'Bell Wireline HIST p9'!N28","v":94},null,{"$f":"IF(OR(((ABS(C13-E13)/E13))>=100%,((ABS(C13-E13)/E13))<=-100%),\"n.m.\",((C13-E13)/ABS(E13)))","v":{"$error":"#NAME?"}},{"$error":"#NAME?"},{"$f":"'Bell Wireline HIST p9'!E28","v":{"$error":"#NAME?"}},null,{"$f":"'Bell Wireline HIST p9'!O28+'Bell Wireline HIST p9'!P28+'Bell Wireline HIST p9'!Q28+'Bell Wireline HIST p9'!N28","v":358},null,{"$f":"IF(OR(((ABS(I13-K13)/K13))>=100%,((ABS(I13-K13)/K13))<=-100%),\"n.m.\",((I13-K13)/ABS(K13)))","v":{"$error":"#NAME?"}}]
["Operating service revenues",null,{"$f":"'Bell Wireline HIST p9'!G29","v":{"$error":"#NAME?"}},null,{"$f":"'Bell Wireline HIST p9'!N29","v":2934},null,{"$f":"IF(OR(((ABS(C14-E14)/E14))>100%,((ABS(C14-E14)/E14))<-100%),\"n.m.\",((C14-E14)/ABS(E14)))","v":{"$error":"#NAME?"}},{"$error":"#NAME?"},{"$f":"'Bell Wireline HIST p9'!E29","v":{"$error":"#NAME?"}},null,{"$f":"'Bell Wireline HIST p9'!O29+'Bell Wireline HIST p9'!P29+'Bell Wireline HIST p9'!Q29+'Bell Wireline HIST p9'!N29","v":11672},null,{"$f":"IF(OR(((ABS(I14-K14)/K14))>100%,((ABS(I14-K14)/K14))<-100%),\"n.m.\",((I14-K14)/ABS(K14)))","v":{"$error":"#NAME?"}}]
["Data ",null,{"$f":"'Bell Wireline HIST p9'!G30","v":{"$error":"#NAME?"}},null,{"$f":"'Bell Wireline HIST p9'!N30","v":132},null,{"$f":"IF(OR(((ABS(C15-E15)/E15))>100%,((ABS(C15-E15)/E15))<-100%),\"n.m.\",((C15-E15)/ABS(E15)))","v":{"$error":"#NAME?"}},{"$error":"#NAME?"},{"$f":"'Bell Wireline HIST p9'!E30","v":{"$error":"#NAME?"}},null,{"$f":"'Bell Wireline HIST p9'!O30+'Bell Wireline HIST p9'!P30+'Bell Wireline HIST p9'!Q30+'Bell Wireline HIST p9'!N30","v":463},null,{"$error":"#NAME?"}]
["Equipment and other",null,{"$f":"'Bell Wireline HIST p9'!G31","v":{"$error":"#NAME?"}},null,{"$f":"'Bell Wireline HIST p9'!N31","v":13},null,{"$error":"#NAME?"},{"$error":"#NAME?"},{"$f":"'Bell Wireline HIST p9'!E31","v":{"$error":"#NAME?"}},null,{"$f":"'Bell Wireline HIST p9'!O31+'Bell Wireline HIST p9'!P31+'Bell Wireline HIST p9'!Q31+'Bell Wireline HIST p9'!N31","v":43},null,{"$error":"#NAME?"}]
["External product revenues",null,{"$f":"'Bell Wireline HIST p9'!G32","v":{"$error":"#NAME?"}},null,{"$f":"'Bell Wireline HIST p9'!N32","v":145},null,{"$error":"#NAME?"},{"$error":"#NAME?"},{"$f":"'Bell Wireline HIST p9'!E32","v":{"$error":"#NAME?"}},null,{"$f":"'Bell Wireline HIST p9'!O32+'Bell Wireline HIST p9'!P32+'Bell Wireline HIST p9'!Q32+'Bell Wireline HIST p9'!N32","v":506},null,{"$error":"#NAME?"}]
["Inter-segment product revenues",null,{"$f":"'Bell Wireline HIST p9'!G33","v":{"$error":"#NAME?"}},null,{"$f":"'Bell Wireline HIST p9'!N33","v":0},null,"n.m",0,{"$f":"'Bell Wireline HIST p9'!E33","v":{"$error":"#NAME?"}},null,{"$f":"'Bell Wireline HIST p9'!O33+'Bell Wireline HIST p9'!P33+'Bell Wireline HIST p9'!Q33+'Bell Wireline HIST p9'!N33","v":0},null,"n.m"]
["Operating product revenues",null,{"$f":"'Bell Wireline HIST p9'!G34","v":{"$error":"#NAME?"}},null,{"$f":"'Bell Wireline HIST p9'!N34","v":145},null,{"$error":"#NAME?"},{"$f":"(C19-F19)/F19","v":{"$error":"#NAME?"}},{"$f":"'Bell Wireline HIST p9'!E34","v":{"$error":"#NAME?"}},null,{"$f":"'Bell Wireline HIST p9'!O34+'Bell Wireline HIST p9'!P34+'Bell Wireline HIST p9'!Q34+'Bell Wireline HIST p9'!N34","v":506},null,{"$error":"#NAME?"}]
["Total external revenues",null,{"$f":"'Bell Wireline HIST p9'!G35","v":{"$error":"#NAME?"}},null,{"$f":"'Bell Wireline HIST p9'!N35","v":2985},null,{"$error":"#NAME?"},{"$f":"(C20-F20)/F20","v":{"$error":"#NAME?"}},{"$f":"'Bell Wireline HIST p9'!E35","v":{"$error":"#NAME?"}},null,{"$f":"'Bell Wireline HIST p9'!O35+'Bell Wireline HIST p9'!P35+'Bell Wireline HIST p9'!Q35+'Bell Wireline HIST p9'!N35","v":11820},null,{"$error":"#NAME?"}]
["Total operating revenues",null,{"$f":"'Bell Wireline HIST p9'!G36","v":{"$error":"#NAME?"}},null,{"$f":"'Bell Wireline HIST p9'!N36","v":3079},null,{"$error":"#NAME?"},{"$f":"(C21-F21)/F21","v":{"$error":"#NAME?"}},{"$f":"'Bell Wireline HIST p9'!E36","v":{"$error":"#NAME?"}},null,{"$f":"'Bell Wireline HIST p9'!O36+'Bell Wireline HIST p9'!P36+'Bell Wireline HIST p9'!Q36+'Bell Wireline HIST p9'!N36","v":12178},null,{"$error":"#NAME?"}]
["Operating costs",null,{"$f":"'Bell Wireline HIST p9'!G37","v":{"$error":"#NAME?"}},null,{"$f":"'Bell Wireline HIST p9'!N37","v":-1753},null,{"$error":"#NAME?"},{"$f":"(-C22+F22)/F22","v":{"$error":"#NAME?"}},{"$f":"'Bell Wireline HIST p9'!E37","v":{"$error":"#NAME?"}},null,{"$f":"'Bell Wireline HIST p9'!O37+'Bell Wireline HIST p9'!P37+'Bell Wireline HIST p9'!Q37+'Bell Wireline HIST p9'!N37","v":-6863},null,{"$error":"#NAME?"}]
["Adjusted EBITDA",null,{"$f":"'Bell Wireline HIST p9'!G38","v":{"$error":"#NAME?"}},null,{"$f":"'Bell Wireline HIST p9'!N38","v":1326},null,{"$error":"#NAME?"},{"$f":"(C23-F23)/F23","v":{"$error":"#NAME?"}},{"$f":"'Bell Wireline HIST p9'!E38","v":{"$error":"#NAME?"}},null,{"$f":"'Bell Wireline HIST p9'!O38+'Bell Wireline HIST p9'!P38+'Bell Wireline HIST p9'!Q38+'Bell Wireline HIST p9'!N38","v":5315},null,0]
["Adjusted EBITDA margin",null,{"$f":"'Bell Wireline HIST p9'!G39","v":{"$error":"#NAME?"}},null,{"$f":"'Bell Wireline HIST p9'!N39","v":0.43099999999999999},null,{"$f":"((ROUND(C24,3)-ROUND(E24,3))*100)","v":{"$error":"#NAME?"}},{"$f":"(C24-F24)*100","v":{"$error":"#NAME?"}},{"$f":"'Bell Wireline HIST p9'!E39","v":{"$error":"#NAME?"}},null,{"$f":"K23/K21","v":0.43644276564296269},null,{"$f":"((ROUND(I24,3)-ROUND(K24,3))*100)","v":{"$error":"#NAME?"}}]
[]
["Capital expenditures ",null,{"$f":"'Bell Wireline HIST p9'!G41","v":1251},null,{"$f":"'Bell Wireline HIST p9'!N41","v":1141},null,{"$f":"IF(OR(((ABS(E26-C26)/E26))>100%,((ABS(E26-C26)/E26))<-100%),\"n.m.\",((E26-C26)/ABS(E26)))","v":-9.6406660823838738E-2},{"$f":"(-C26+F26)/F26","v":{"$error":"#DIV/0!"}},{"$f":"'Bell Wireline HIST p9'!E41","v":3887},null,{"$f":"'Bell Wireline HIST p9'!O41+'Bell Wireline HIST p9'!P41+'Bell Wireline HIST p9'!Q41+'Bell Wireline HIST p9'!N41","v":3612},null,{"$f":"IF(OR(((ABS(K26-I26)/K26))>100%,((ABS(K26-I26)/K26))<-100%),\"n.m.\",((K26-I26)/ABS(K26)))","v":-7.6135105204872641E-2}]
["Capital intensity ",null,{"$f":"'Bell Wireline HIST p9'!G42","v":{"$error":"#NAME?"}},null,{"$f":"'Bell Wireline HIST p9'!N42","v":0.37057486196817147},null,{"$f":"((ROUND(E27,3)-ROUND(C27,3))*100)","v":{"$error":"#NAME?"}},{"$f":"(-(C27-F27)*100)","v":{"$error":"#NAME?"}},{"$f":"'Bell Wireline HIST p9'!E42","v":{"$error":"#NAME?"}},null,{"$f":"K26/K21","v":0.29660042699950728},null,{"$f":"((ROUND(K27,3)-ROUND(I27,3))*100)","v":{"$error":"#NAME?"}}]
["Retail high-speed Internet subscribers(4) "]
["Retail net subscriber activations",null,{"$f":"'Bell Wireline HIST p9'!G44","v":63465.865849099995},null,{"$f":"'Bell Wireline HIST p9'!N44","v":47618},null,{"$f":"IF(OR(((ABS(C29-E29)/E29))>100%,((ABS(C29-E29)/E29))<-100%),\"n.m.\",((C29-E29)/ABS(E29)))","v":0.33281250470620344},{"$f":"(C29-F29)/F29","v":{"$error":"#DIV/0!"}},{"$f":"'Bell Wireline HIST p9'!E44","v":201762},null,{"$f":"'Bell Wireline HIST p9'!O44+'Bell Wireline HIST p9'!P44+'Bell Wireline HIST p9'!Q44+'Bell Wireline HIST p9'!N44","v":152285},null,{"$f":"IF(OR(((ABS(I29-K29)/K29))>100%,((ABS(I29-K29)/K29))<-100%),\"n.m.\",((I29-K29)/ABS(K29)))","v":0.32489739632925108}]
["Retail subscribers EOP(A) (B)",null,{"$f":"'Bell Wireline HIST p9'!G45","v":4258570},null,{"$f":"'Bell Wireline HIST p9'!N45","v":3861652.7233591001},null,0.10278430119828,{"$f":"(C30-F30)/F30","v":{"$error":"#DIV/0!"}},{"$f":"'Bell Wireline HIST p9'!E45","v":4258570},null,{"$f":"'Bell Wireline HIST p9'!L45","v":3861652.7233591001},null,0.10278430119828]
["Retail TV subscribers(4)"]
["Retail net subscriber activations (losses) ",null,{"$f":"'Bell Wireline HIST p9'!G47","v":14183},null,{"$f":"'Bell Wireline HIST p9'!N47","v":6049},null,"n.m.",{"$f":"-(C32-F32)/F32","v":{"$error":"#DIV/0!"}},{"$f":"'Bell Wireline HIST p9'!E47","v":5148},null,{"$f":"'Bell Wireline HIST p9'!O47+'Bell Wireline HIST p9'!P47+'Bell Wireline HIST p9'!Q47+'Bell Wireline HIST p9'!N47","v":2530},null,"n.m."]
["   Internet protocol television (IPTV)",null,{"$f":"'Bell Wireline HIST p9'!G48","v":40209},null,{"$f":"'Bell Wireline HIST p9'!N48","v":29191},null,0.37744510294268779,{"$f":"(C33-F33)/F33","v":{"$error":"#DIV/0!"}},{"$f":"'Bell Wireline HIST p9'!E48","v":94400},null,{"$f":"'Bell Wireline HIST p9'!O48+'Bell Wireline HIST p9'!P48+'Bell Wireline HIST p9'!Q48+'Bell Wireline HIST p9'!N48","v":76068},null,0.24099489930062576]
["   Satellite",null,{"$f":"+'Bell Wireline HIST p9'!G49","v":-26026},null,{"$f":"+'Bell Wireline HIST p9'!N49","v":-23142},null,-0.12462189957652753,null,{"$f":"'Bell Wireline HIST p9'!E49","v":-89252},null,{"$f":"'Bell Wireline HIST p9'!O49+'Bell Wireline HIST p9'!P49+'Bell Wireline HIST p9'!Q49+'Bell Wireline HIST p9'!N49","v":-73538},null,-0.21368544154042807]
["Total retail subscribers EOP(A) (B)",null,{"$f":"'Bell Wireline HIST p9'!G50","v":2751498},null,{"$f":"'Bell Wireline HIST p9'!N50","v":2735010.1380113},null,6.0284463883884419E-3,{"$f":"(C35-F35)/F35","v":{"$error":"#DIV/0!"}},{"$f":"'Bell Wireline HIST p9'!E50","v":2751498},null,{"$f":"'Bell Wireline HIST p9'!L50","v":2735010.1380113},null,6.0284463883884419E-3]
["   IPTV(A) (B)",null,{"$f":"'Bell Wireline HIST p9'!G51","v":1988181},null,{"$f":"'Bell Wireline HIST p9'!N51","v":1882441.1380113999},null,5.6171669782091087E-2,{"$f":"(C36-F36)/F36","v":{"$error":"#DIV/0!"}},{"$f":"'Bell Wireline HIST p9'!E51","v":1988181},null,{"$f":"'Bell Wireline HIST p9'!L51","v":1882441.1380113999},null,5.6171669782091087E-2]
["   Satellite",null,{"$f":"'Bell Wireline HIST p9'!G52","v":763317},null,{"$f":"'Bell Wireline HIST p9'!N52","v":852568.9999999},null,-0.1046859550369653,null,{"$f":"'Bell Wireline HIST p9'!E52","v":763317},null,{"$f":"'Bell Wireline HIST p9'!N52","v":852568.9999999},null,-0.1046859550369653]
["Retail residential network access services (NAS)(4)"]
["Retail residential NAS lines net losses",null,{"$f":"'Bell Wireline HIST p9'!G54","v":-37878},null,{"$f":"'Bell Wireline HIST p9'!N54","v":-40211},null,5.8018950038546666E-2,{"$f":"-(C39-F39)/F39","v":{"$error":"#DIV/0!"}},{"$f":"'Bell Wireline HIST p9'!E54","v":-175788},null,{"$f":"'Bell Wireline HIST p9'!O54+'Bell Wireline HIST p9'!P54+'Bell Wireline HIST p9'!Q54+'Bell Wireline HIST p9'!N54","v":-185327},null,5.1471183367776958E-2]
["Retail residential NAS lines(A) (B)",null,{"$f":"'Bell Wireline HIST p9'!G55","v":2190771},null,{"$f":"'Bell Wireline HIST p9'!N55","v":2298605},null,-4.6912801460015967E-2,{"$f":"(C40-F40)/F40","v":{"$error":"#DIV/0!"}},{"$f":"'Bell Wireline HIST p9'!E55","v":2190771},null,{"$f":"'Bell Wireline HIST p9'!N55","v":2298605},null,-4.6912801460015967E-2]
[]
["n.m. : not meaningful"]
["(A)","In Q1 2022, as a result of the acquisition of EBOX and other related companies, our retail high-speed Internet, retail IPTV and retail residential NAS lines subscriber bases increased by 67,090, 9,025 and 3,456 subscribers, respectively."]
["(B)","In Q4 2022, as a result of the acquisition of Distributel Communications Limited (Distributel), our retail high-speed Internet, retail IPTV and retail residential NAS lines subscriber bases increased by 128,065, 2,315 and 64,498 subscribers, respectively."]

{"sheet":"Bell Wireline HIST p9","index":16,"n_rows":71,"n_cols":20,"rows_kept":71,"cut":false,"hidden":true,"merged":[[58,3,59,16],[56,3,56,16],[57,3,57,16]]}
["CORPORATE"]
["ACTUAL"]
["ALL_DS",null,"All Data Sources"]
["All Posting Levels"]
["Canadian Dollar"]
["All Trading Partners",null,"TP_IC - All Intercos"]
["Year To Date",null,"TP_EXTERNAL - External (Third Party)"]
["Quarter to date"]
[]
["WRLINE"]
[]
[]
[null,null,null,null,"2022.Q4 - 2022.Q4",null,"2021.Q4 - 2021.Q4"]
[]
[]
[]
[null,null,null,null,null,null,null,null,null,null,null,null,null,null,null,null,"Bell Wireline - Historical Trend (2)"]
[]
[]
[]
[null,null,"(In millions of Canadian dollars, except where otherwise indicated) (unaudited)",null,"TOTAL\n2022",null,"Q4 22","Q3 22","Q2 22","Q1 22",null,"TOTAL\n2021",null,"Q4 21","Q3 21","Q2 21","Q1 21",null,"CY CHECK","PY CHECK"]
[null,null,"Bell Wireline"]
[null,null,"Operating revenues"]
["T4D0100 - Data Revenue (service)","T401050 - Data Revenue (product)","Data ",null,{"$f":"((ROUND((_xll.EPMRetrieveData($A$1,$A$24,$A$2,$A$3,$A$4,$A$5,$C$7,$A$7,$A$10,E13)+_xll.EPMRetrieveData($A$1,$B$24,$A$2,$A$3,$A$4,$A$5,$C$7,$A$7,$A$10,E13))/1000000,0)-E30))","v":{"$error":"#NAME?"}},null,{"$f":"E24-H24-I24-J24","v":{"$error":"#NAME?"}},1987,1974,1953,null,7871,null,1986,1976,1944,1965,null,{"$f":"SUM(G24:J24)=E24","v":{"$error":"#NAME?"}},{"$f":"Q24+P24+O24+N24=L24","v":true}]
[{"$f":" _xll.EPMOlapMemberO(\"[ACCOUNT].[PARENTH1].[T4D0200]\",\"\",\"T4D0200 - Voice Revenue (service)\",\"\",\"000\")","v":{"$error":"#NAME?"}},null,"Voice",null,{"$f":"ROUND((_xll.EPMRetrieveData($A$1, _xll.EPMMemberID($A$25), $A$2, $A$3, $A$4, $A$5, $C$7, $A$7, $A$10, E13))/1000000, 0)","v":{"$error":"#NAME?"}},null,{"$error":"#NAME?"},739,756,771,null,3154,null,779,778,794,803,null,{"$f":"SUM(G25:J25)=E25","v":{"$error":"#NAME?"}},{"$f":"Q25+P25+O25+N25=L25","v":true}]
["T401020 - Other Service Revenue","T401070 - Other Product Revenue","Other services",null,{"$f":"(ROUND((_xll.EPMRetrieveData($A$1,$A$26,$A$2,$A$3,$A$4,$A$5,$C$7,$A$7,$A$10,E13)+_xll.EPMRetrieveData($A$1,$B$26,$A$2,$A$3,$A$4,$A$5,$C$7,$A$7,$A$10,E13))/1000000,0)-E31)+1","v":{"$error":"#NAME?"}},null,{"$error":"#NAME?"},77,78,77,null,289,null,75,73,67,74,null,{"$error":"#NAME?"},true]
["T401070",null,"External service revenues",null,{"$f":"SUM(E24:E26)","v":{"$error":"#NAME?"}},null,{"$error":"#NAME?"},2803,2808,2801,null,11314,null,2840,2827,2805,2842,null,{"$error":"#NAME?"},true]
["T401010",null,"Inter-segment service revenues",null,{"$f":"(ROUND(_xll.EPMRetrieveData($A$1,$A$28,$A$2,$A$3,$A$4,$A$5,$C$6,$A$7,$A$10,E13)/1000000,0))-1","v":{"$error":"#NAME?"}},null,{"$error":"#NAME?"},104,101,102,null,358,null,94,93,86,85,null,{"$error":"#NAME?"},true]
[null,null,"Operating service revenues",null,{"$f":"E28+E27","v":{"$error":"#NAME?"}},null,{"$error":"#NAME?"},2907,2909,2903,null,11672,null,2934,2920,2891,2927,null,{"$error":"#NAME?"},true]
["T401050",null,"Data ",null,{"$f":"((ROUND(_xll.EPMRetrieveData($A$1,$A$30,$A$2,$A$3,$A$4,$A$5,$C$7,$A$7,$A$10,E13)/1000000,0)))","v":{"$error":"#NAME?"}},null,{"$error":"#NAME?"},130,73,99,null,463,null,132,86,101,144,null,{"$error":"#NAME?"},true]
[null,null,"Equipment and other",null,{"$f":"ROUND(_xll.EPMRetrieveData($A$1,$A$27,$A$2,$A$3,$A$4,$A$5,$C$7,$A$7,$A$10,E13)/1000000,0)","v":{"$error":"#NAME?"}},null,{"$error":"#NAME?"},9,13,11,null,43,null,13,9,11,10,null,{"$error":"#NAME?"},true]
[null,null,"External product revenues",null,{"$f":"E31+E30","v":{"$error":"#NAME?"}},null,{"$error":"#NAME?"},139,86,110,null,506,null,145,95,112,154,null,{"$error":"#NAME?"},true]
["T401040",null,"Inter-segment product revenues",null,{"$f":"ROUND(_xll.EPMRetrieveData($A$1,$A$33,$A$2,$A$3,$A$4,$A$5,$C$6,$A$7,$A$10,E13)/1000000,0)","v":{"$error":"#NAME?"}},null,{"$error":"#NAME?"},0,0,0,null,0,null,0,0,0,0,null,{"$error":"#NAME?"},true]
[null,null,"Operating product revenues",null,{"$f":"E33+E32","v":{"$error":"#NAME?"}},null,{"$error":"#NAME?"},139,86,110,null,506,null,145,95,112,154,null,{"$error":"#NAME?"},true]
["t401000",null,"Total external revenues",null,{"$f":"ROUND(_xll.EPMRetrieveData($A$1,$A$35,$A$2,$A$3,$A$4,$A$5,$C$7,$A$7,$A$10,E13)/1000000,0)","v":{"$error":"#NAME?"}},null,{"$error":"#NAME?"},2942,2894,2911,null,11820,null,2985,2922,2917,2996,null,{"$error":"#NAME?"},true]
[null,null,"Total operating revenues",null,{"$f":"E34+E29","v":{"$error":"#NAME?"}},null,{"$error":"#NAME?"},3046,2995,3013,null,12178,null,3079,3015,3003,3081,null,{"$error":"#NAME?"},true]
[null,null,"Operating costs",null,{"$f":"'BCE Inc. Seg Info HIST p5'!E31","v":{"$error":"#NAME?"}},null,{"$error":"#NAME?"},-1729,-1680,-1646,null,-6863,null,-1753,-1682,-1710,-1718,null,{"$error":"#NAME?"},true]
[null,null,"Adjusted EBITDA",null,{"$f":"'BCE Inc. Seg Info HIST p5'!E39","v":{"$error":"#NAME?"}},null,{"$error":"#NAME?"},1317,1315,1367,null,5315,null,1326,1333,1293,1363,null,{"$error":"#NAME?"},true]
[null,null,"Adjusted EBITDA margin",null,{"$f":"'BCE Inc. Seg Info HIST p5'!E40","v":{"$error":"#NAME?"}},null,{"$f":"'BCE Inc. Seg Info HIST p5'!G40","v":{"$error":"#NAME?"}},0.432,0.439,0.45400000000000001,null,0.436,null,0.43099999999999999,0.44212271973466005,0.43099999999999999,0.442]
[]
[null,null,"Capital expenditures ",null,{"$f":"'BCE Inc. Seg Info HIST p5'!E49","v":3887},null,{"$f":"'BCE Inc. Seg Info HIST p5'!G49","v":1251},1038,910,{"$f":"'BCE Inc. Seg Info HIST p5'!J49","v":688},{"$f":"'BCE Inc. Seg Info HIST p5'!K49","v":0},{"$f":"'BCE Inc. Seg Info HIST p5'!L49","v":3612},{"$f":"'BCE Inc. Seg Info HIST p5'!M49","v":0},{"$f":"'BCE Inc. Seg Info HIST p5'!N49","v":1141},{"$f":"'BCE Inc. Seg Info HIST p5'!O49","v":884},{"$f":"'BCE Inc. Seg Info HIST p5'!P49","v":880},{"$f":"'BCE Inc. Seg Info HIST p5'!Q49","v":707},null,true,true]
[null,null,"Capital intensity ",null,{"$f":"'BCE Inc. Seg Info HIST p5'!E50","v":{"$error":"#NAME?"}},null,{"$f":"'BCE Inc. Seg Info HIST p5'!G50","v":{"$error":"#NAME?"}},0.34077478660538413,0.30383973288814692,{"$f":"'BCE Inc. Seg Info HIST p5'!J50","v":0.22834384334550281},{"$f":"'BCE Inc. Seg Info HIST p5'!K50","v":{"$error":"#DIV/0!"}},{"$f":"'BCE Inc. Seg Info HIST p5'!L50","v":0.29660042699950728},{"$f":"'BCE Inc. Seg Info HIST p5'!M50","v":{"$error":"#DIV/0!"}},{"$f":"'BCE Inc. Seg Info HIST p5'!N50","v":0.37057486196817147},{"$f":"'BCE Inc. Seg Info HIST p5'!O50","v":0.29320066334991707},{"$f":"'BCE Inc. Seg Info HIST p5'!P50","v":0.29304029304029305},{"$f":"'BCE Inc. Seg Info HIST p5'!Q50","v":0.22947095098993833}]
[null,null,"Retail high-speed Internet subscribers",null,null,null,null,null,null,null,null,null,null,null,null,null,null,null,true,true]
[null,null,"Retail net subscriber activations",null,201762,null,{"$f":"E44-H44-I44-J44","v":63465.865849099995},89652,22619.999999999996,26024.134150900001,null,152285,null,47618,65779,17680,21208,null,true,true]
[null,null,"Retail subscribers EOP(A) (B)",null,4258570,null,{"$f":"E45","v":4258570},4067038.85751,3977386.85751,3954766.85751,null,3861652.7233591001,null,3861652.7233591001,3814034.6467358,3748255.6467358,3730576]
[null,null,"Retail TV subscribers",null,null,null,null,null,null,null,null,null,null,null,null,null,null,null,true,true]
[null,null,"Retail net subscriber activations (losses) ",null,5148,null,{"$f":"E47-H47-I47-J47","v":14183},10853,-11527,-8361,null,2530,null,6049,10521,-4928,-9112,null,true,true]
[null,null,"  IPTV",null,94400,null,{"$f":"E48-H48-I48-J48","v":40209},38093,3838,12260,null,76068,null,29191,31641,4540,10696,null,true,true]
[null,null,"  Satellite",null,-89252,null,{"$f":"E49-H49-I49-J49","v":-26026},-27240,-15365,-20621,null,-73538,null,-23142,-21120,-9468,-19808,null,true,true]
[null,null,"Total retail subscribers EOP(A) (B)",null,{"$f":"SUM(E51:E52)","v":2751498},null,{"$f":"E50","v":2751498},2734999.5638286001,2724147.1380113,2735674.1380113,null,2735010.1380113,null,2735010.1380113,2728961.1380113,2718440.1380113,2723368]
[null,null,"  IPTV(A) (B)",null,1988181,null,{"$f":"E51","v":1988181},1945656.5638287,1907564.1380113999,1903726.1380113999,null,1882441.1380113999,null,1882441.1380113999,1853250.1380113999,1821609.1380113999,1817069]
[null,null,"  Satellite",null,763317,null,{"$f":"E52","v":763317},789342.9999999,816582.9999999,831947.9999999,null,852568.9999999,null,852568.9999999,875710.9999999,896830.9999999,906299]
[null,null,"Retail residential NAS",null,null,null,null,null,null,null,null,null,null,null,null,null,null,null,true,true]
[null,null,"Retail residential NAS lines net losses",null,-175788,null,{"$f":"E54-H54-I54-J54","v":-37878},-42853,-52712,-42345,null,-185327,null,-40211,-42755,-51292,-51069,null,true,true]
[null,null,"Retail residential NAS lines(A) (B)",null,2190771,null,{"$f":"E55","v":2190771},2164151,2207004,2259716,null,2298605,null,2298605,2338816.0000001001,2381571.0000001001,2432863]
[]
[null,null,"(A)","In Q1 2022, as a result of the acquisition of EBOX and other related companies, our retail high-speed Internet, retail IPTV and retail residential NAS lines subscriber bases increased by 67,090, 9,025 and 3,456 subscribers, respectively."]
[null,null,"(B)","In Q4 2022, as a result of the acquisition of Distributel, our retail high-speed Internet, retail IPTV and retail residential NAS lines subscriber bases increased by 128,065, 2,315 and 64,498 subscribers, respectively."]
[]
[]
[]
[]
[]
[]
[]
[null,null,null,"External service revenues",{"$f":"SUM(E24:E26)=E27","v":{"$error":"#NAME?"}},null,null,{"$f":"SUM(H24:H26)=H27","v":true},{"$f":"SUM(I24:I26)=I27","v":true},{"$f":"SUM(J24:J26)=J27","v":true},true,true,true,true,true,true,true]
[null,null,null,"Operating service revenues",{"$f":"(E27+E28)=E29","v":{"$error":"#NAME?"}},null,null,{"$f":"(H27+H28)=H29","v":true},{"$f":"(I27+I28)=I29","v":true},{"$f":"(J27+J28)=J29","v":true},true,true,true,true,true,true,true]
[null,null,null,"External product revenues",{"$f":"(E30+E31)=E32","v":{"$error":"#NAME?"}},null,null,{"$f":"(H30+H31)=H32","v":true},{"$f":"(I30+I31)=I32","v":true},{"$f":"(J30+J31)=J32","v":true},true,true,true,true,true,true,true]
[null,null,null,"Total external revenues",{"$f":"(E27+E32)=E35","v":{"$error":"#NAME?"}},null,null,{"$f":"(H27+H32)=H35","v":true},{"$f":"(I27+I32)=I35","v":true},{"$f":"(J27+J32)=J35","v":true},true,true,true,true,true,true,true]
[null,null,null,"Total operating revenues",{"$f":"(E29+E34)=E36","v":{"$error":"#NAME?"}},null,null,{"$f":"(H29+H34)=H36","v":true},{"$f":"(I29+I34)=I36","v":true},{"$f":"(J29+J34)=J36","v":true},true,true,true,true,true,true,true]
[null,null,null,"Adjusted EBITDA",{"$f":"(E36+E37)=E38","v":{"$error":"#NAME?"}},null,null,{"$f":"(H36+H37)=H38","v":true},{"$f":"(I36+I37)=I38","v":true},{"$f":"(J36+J37)=J38","v":true},true,true,true,true,true,true,true]

{"sheet":"CTS HIST Info p9","index":17,"n_rows":35,"n_cols":13,"rows_kept":35,"cut":false,"hidden":false,"merged":[[3,0,3,1],[32,1,32,12],[34,1,34,12],[33,1,33,12],[31,1,31,12]]}
[null,null,null,null,null,null,null,null,null,null,null,null,"Indicateurs de Bell SCT – Tendance historique"]
[]
[null,null,"Cumul",null,null,null,null,"TOTAL"]
["(en millions de dollars canadiens, sauf indication contraire) (non audité)",null,"2025",null,"T2 25","T1 25",null,"2024",null,"T4 24","T3 24","T2 24","T1 24"]
["Abonnés utilisant des téléphones mobiles"]
["Activations brutes d’abonnés",null,979182,null,510597,468585,null,2351507,null,680471,588263,575334,507439]
["Services postpayés",null,651688,null,331438,320250,null,1641053,null,510850,374116,389213,366874]
["Services prépayés",null,327494,null,179159,148335,null,710454,null,169621,214147,186121,140565]
["Activations (pertes) nettes d’abonnés",null,93883,null,94479,-596,null,309517,null,51070,102196,131043,25208]
["Services postpayés",null,34949,null,44547,-9598,null,213408,null,56550,33111,78500,45247]
["Services prépayés",null,58934,null,49932,9002,null,96109,null,-5480,69085,52543,-20039]
["Abonnés à la fin de la période (B) (C)",null,10382457,null,10382457,10287978,null,10288574,null,10288574,10361720,10337495,10206452]
["Services postpayés",null,9565385,null,9565385,9520838,null,9530436,null,9530436,9473886,9440775,9362275]
["Services prépayés (B) (C)",null,817072,null,817072,767140,null,758138,null,758138,887834,896720,844177]
["RMU combiné ($/mois) (B) (C)",null,57.35,null,57.61,57.08,null,57.9,null,57.15,58.26,58.04,58.14]
["Taux de désabonnement combiné (%) (moyen par mois)",null,1.4500000000000001E-2,null,1.3599999999999999E-2,1.55E-2,null,1.67E-2,null,2.0299999999999999E-2,1.5800000000000002E-2,1.47E-2,1.5900000000000001E-2]
["Services postpayés",null,1.1299999999999999E-2,null,1.06E-2,1.21E-2,null,1.3299999999999999E-2,null,1.66E-2,1.2800000000000001E-2,1.18E-2,1.21E-2]
["Services prépayés",null,5.4100000000000002E-2,null,5.0599999999999999E-2,5.7700000000000001E-2,null,5.28E-2,null,6.1499999999999999E-2,4.6600000000000003E-2,4.5999999999999999E-2,5.74E-2]
["Activations d’abonnés utilisant des appareils mobiles"]
["Activations nettes d’abonnés ",null,133486,null,97502,35984,null,310882,null,100343,56216,87917,66406]
["Abonnés à la fin de la période",null,3176916,null,3176916,3079414,null,3043430,null,3043430,2943087,2886871,2798954]
["Abonnés des services Internet haute vitesse de détail"]
["Activations nettes d’abonnés des services de détail",null,14514,null,4999,9515,null,131521,null,34187,42415,23841,31078]
["Abonnés des services de détail à la fin de la période (A) (C)",null,4421961,null,4421961,4416962,null,4490896,null,4490896,4456709,4520553,4496712]
["Abonnés des services de télé IP de détail"]
["(Pertes) activations nettes d’abonnés des services de télé IP de détail",null,-31822,null,-15851,-15971,null,21614,null,-444,9197,-1313,14174]
["Abonnés des services de télé IP de détail à la fin de la période (A) (D)",null,2100690,null,2100690,2116541,null,2132953,null,2132953,2133397,2124200,2084516]
["SAR résidentiels de détail"]
["Pertes nettes d’abonnés des SAR résidentiels de détail",null,-92130,null,-44700,-47430,null,-187426,null,-42591,-47674,-53250,-43911]
["Abonnés des SAR résidentiels de détail (A)",null,1727911,null,1727911,1772611,null,1834191,null,1834191,1876782,1924456,1977706]
[]
["(A)","Au T1 2025, nous avons réduit notre clientèle d’abonnés des services Internet haute vitesse de détail, des services de télé IP de détail et des SAR résidentiels de détail de 80 666 abonnés, de 441 abonnés et de 14 150 abonnés, respectivement, au 31 mars 2025, car nous avons cessé de vendre de nouveaux forfaits des marques Distributel, Acanac, Oricom et B2B2C pour ces services. En outre, au début du T1 2025, nous avons réduit notre clientèle d'abonnés des services Internet haute vitesse de détail de 2 783 abonnés pour tenir compte des désactivations de clients de l’exercice précédent, à la suite d’un examen des comptes de nos abonnés."]
["(B)","Au T4 2024, nous avons retiré 124 216 abonnés des services prépayés utilisant des téléphones mobiles de Bell de notre clientèle d’abonnés des téléphones mobiles prépayés au 31 décembre 2024, car nous avons cessé de vendre de nouveaux forfaits pour ce service à compter de cette date."]
["(C)","Au T3 2024, nous avons retiré 77 971 abonnés des services prépayés utilisant des téléphones mobiles de Virgin Plus de notre clientèle d’abonnés des téléphones mobiles prépayés au 30 septembre 2024, car nous avons cessé de vendre de nouveaux forfaits pour ce service à compter de cette date. De plus, en raison d’une récente décision du CRTC visant les services d’accès Internet haute vitesse de gros, nous ne sommes plus en mesure de revendre les services d’accès Internet par câble à de nouveaux clients dans notre zone de couverture des services sur fil depuis le 12 septembre 2024 et, par conséquent, nous avons retiré l’ensemble des 106 259 abonnés existants des services de câblodistribution dans la zone de couverture des services sur fil de notre clientèle d’abonnés aux services d’accès Internet haute vitesse de détail à cette date."]
["(D)","Au T2 2024, nous avons augmenté le nombre d’abonnés des services de télé IP de détail de 40 997 pour aligner le calcul de la désactivation de nos services de télé en continu Télé Fibe sur celui de notre service de Télé Fibe traditionnel."]

{"sheet":"Net Debt & Bell other info p10","index":18,"n_rows":51,"n_cols":11,"rows_kept":51,"cut":false,"hidden":false,"merged":[[22,0,22,1],[28,0,28,1],[42,0,42,1],[50,1,50,10]]}
[null,null,null,null,null,null,null,null,null,null,"BCE"]
[null,null,null,null,null,null,null,null,null,null,"Dette nette et autres renseignements"]
[]
[]
["BCE – Dette nette et actions privilégiées"]
["(en millions de dollars canadiens, sauf indication contraire) (non audité)"]
[]
[null,null,null,null,null,null,null,null,"30 juin","31 mars","31 décembre"]
[null,null,null,null,null,null,null,null,2025,2025,2024]
[]
["Dette à long terme ",null,null,null,null,null,null,null,32522,33869,32835]
["Moins : 50 % de la dette subordonnée de rang inférieur",null,null,null,null,null,null,null,-2146,-2225,0]
["Dette à court terme",null,null,null,null,null,null,null,5037,5323,7669]
["50 % des actions privilégiées",null,null,null,null,null,null,null,1712,1740.5,1767]
["Trésorerie",null,null,null,null,null,null,null,-507,-1049,-1572]
["Équivalents de trésorerie",null,null,null,null,null,null,null,-3,-3,0]
["Placements à court terme",null,null,null,null,null,null,null,0,0,-400]
["Dette nette (A)",null,null,null,null,null,null,null,36615,37655.5,40299]
["Ratio de levier financier net (A)",null,null,null,null,null,null,null,3.47,3.56,3.81]
[]
[]
["Informations sur les flux de trésorerie "]
["(en millions de dollars canadiens, sauf indication contraire) (non audité) ",null,null,"T2","T2","Variation ","% de","Cumul","Cumul","Variation ","% de"]
[null,null,null,2025,2024,"\n($)"," variation",2025,2024,"\n($)"," variation"]
["Flux de trésorerie disponibles (FTD) (A) et FTD après paiement au titre des obligations locatives (A) "]
["Flux de trésorerie liés aux activités d’exploitation",null,null,1947,2137,-190,-8.8909686476368738E-2,3518,3269,249,7.6170082594065464E-2]
["Dépenses d’investissement ",null,null,-763,-978,215,0.21983640081799591,-1492,-1980,488,0.24646464646464647]
["Dividendes en trésorerie payés sur actions privilégiées",null,null,-38,-45,7,0.15555555555555556,-77,-91,14,0.15384615384615385]
["Dividendes en trésorerie payés par des filiales aux détenteurs\n   de participations ne donnant pas le contrôle",null,null,0,-28,28,1,-13,-42,29,0.69047619047619047]
["Coûts liés aux acquisitions et autres payés",null,null,6,11,-5,-0.45454545454545453,14,26,-12,-0.46153846153846156]
["FTD",null,null,1152,1097,55,5.0136736554238837E-2,1950,1182,768,0.64974619289340096]
["Paiement de capital au titre des obligations locatives",null,null,-278,-270,-8,-2.9629629629629631E-2,-582,-567,-15,-2.6455026455026454E-2]
["FTD après paiement au titre des obligation locatives",null,null,874,827,47,5.6831922611850064E-2,1368,615,753,"n.s."]
[]
[]
["Informations sur les flux de trésorerie – Tendance historique"]
["(en millions de dollars canadiens, sauf indication contraire) (non audité)",null,null,"Cumul","T2","T1","TOTAL","T4","T3","T2","T1"]
[null,null,null,2025,2025,2025,"2024",2024,2024,2024,2024]
["FTD et FTD après paiement au titre des obligations locatives"]
["Flux de trésorerie liés aux activités d’exploitation",null,null,3518,1947,1571,6988,1877,1842,2137,1132]
["Dépenses d’investissement ",null,null,-1492,-763,-729,-3897,-963,-954,-978,-1002]
["Dividendes en trésorerie payés sur actions privilégiées",null,null,-77,-38,-39,-187,-53,-43,-45,-46]
["Dividendes en trésorerie payés par des filiales aux détenteurs \n   de participations ne donnant pas le contrôle",null,null,-13,0,-13,-68,-12,-14,-28,-14]
["Coûts liés aux acquisitions et autres payés",null,null,14,6,8,52,25,1,11,15]
["FTD",null,null,1950,1152,798,2888,874,832,1097,85]
["Paiement de capital au titre des obligations locatives",null,null,-582,-278,-304,-1142,-270,-305,-270,-297]
["FTD après paiement au titre des obligation locatives",null,null,1368,874,494,1746,604,527,827,-212]
[]
[]
["n.s. : non significatif"]
["(A)","La dette nette, les flux de trésorerie disponibles et les flux de trésorerie disponibles après les paiements au titre d'obligations locatives sont des mesures financières non conformes aux PCGR, et le ratio de levier financier net est une mesure de gestion du capital. Voir la note 2.1 Mesures financières non conformes aux PCGR et la note‍ 2.4 Mesures de gestion du capital dans les notes annexes du présent rapport pour en savoir plus sur ces mesures. "]

{"sheet":"BCE Inc. BS p11","index":19,"n_rows":61,"n_cols":6,"rows_kept":61,"cut":false,"hidden":false,"merged":[]}
[null,null,null,null,null,"BCE"]
[null,null,null,null,null,"États consolidés de la situation financière"]
[]
[null,"30 juin",null,"31 mars",null,"31 décembre"]
["(en millions de dollars canadiens, sauf indication contraire) (non audité)",2025,null,2025,null,2024]
["ACTIF"]
["Actifs courants"]
["Trésorerie ",507,null,1049,null,1572]
["Équivalents de trésorerie",3,null,3,null,0]
["Placements à court terme",0,null,0,null,400]
["Créances clients et autres débiteurs",4011,null,4042,null,4489]
["Stocks",453,null,422,null,420]
["Actifs sur contrats",485,null,495,null,477]
["Coûts des contrats",713,null,753,null,702]
["Charges payées d’avance",399,null,344,null,259]
["Autres actifs courants",409,null,593,null,524]
["Actifs détenus en vue de la vente",87,null,79,null,80]
["Total des actifs courants",7067,null,7780,null,8923]
["Actifs non courants   "]
["Actifs sur contrats",259,null,279,null,282]
["Coûts des contrats",955,null,911,null,888]
["Immobilisations corporelles",29520,null,29777,null,30001]
["Immobilisations incorporelles",16737,null,16817,null,16786]
["Actifs d’impôt différé",138,null,152,null,136]
["Participations dans des entreprises associées et des coentreprises",335,null,337,null,341]
["Actifs au titre des avantages postérieurs à l’emploi ",3710,null,3647,null,3578]
["Autres actifs non courants",2238,null,2292,null,2289]
["Goodwill",10175,null,10170,null,10261]
["Total des actifs non courants ",64067,null,64382,null,64562]
["Total de l’actif ",71134,null,72162,null,73485]
["PASSIF "]
["Passifs courants"]
["Dettes fournisseurs et autres passifs",4288,null,4134,null,4507]
["Passifs sur contrats",677,null,773,null,774]
["Intérêts à payer",419,null,284,null,392]
["Dividendes à payer",425,null,944,null,933]
["Passifs d’impôt exigible",229,null,137,null,42]
["Dette à court terme",5037,null,5323,null,7669]
["Passifs détenus en vue de la vente",500,null,525,null,529]
["Total des passifs courants",11575,null,12120,null,14846]
["Passifs non courants  "]
["Passifs sur contrats",374,null,369,null,350]
["Dette à long terme",32522,null,33869,null,32835]
["Passifs d’impôt différé ",5516,null,5335,null,5244]
["Obligations au titre des avantages postérieurs à l’emploi",1154,null,1189,null,1204]
["Autres passifs non courants",1616,null,1661,null,1646]
["Total des passifs non courants ",41182,null,42423,null,41279]
["Total du passif ",52757,null,54543,null,56125]
[" "]
["CAPITAUX PROPRES"]
["Capitaux propres attribuables aux actionnaires de BCE"]
["Actions privilégiées",3424,null,3481,null,3533]
["Actions ordinaires",21493,null,21174,null,20860]
["Surplus d’apport ",1295,null,1271,null,1278]
["Cumul des autres éléments du bénéfice global (de la perte globale)",240,null,45,null,-159]
["Déficit",-8385,null,-8638,null,-8441]
["Total des capitaux propres attribuables aux actionnaires de BCE ",18067,null,17333,null,17071]
["Participations ne donnant pas le contrôle",310,null,286,null,289]
["Total des capitaux propres ",18377,null,17619,null,17360]
["Total du passif et des capitaux propres ",71134,null,72162,null,73485]
["Nombre d’actions ordinaires en circulation (en millions)",932.5,null,921.8,null,912.3]

{"sheet":"BCE Inc. CF Summary p12","index":20,"n_rows":51,"n_cols":12,"rows_kept":51,"cut":false,"hidden":false,"merged":[]}
[null,null,null,null,null,null,null,null,null,null,null,"BCE"]
[null,null,null,null,null,null,null,null,null,null,null,"Données consolidées sur les flux de trésorerie"]
[]
[null,"T2",null,"T2",null,"Variation",null,"Cumul",null,"Cumul",null,"Variation"]
["(en millions de dollars canadiens, sauf indication contraire) (non audité)",2025,null,2024,null,"($)",null,2025,null,2024,null,"($)"]
[]
["Bénéfice net",644,null,604,null,40,null,1327,null,1061,null,266]
["Ajustements de rapprochement du bénéfice net et des flux de trésorerie liés aux activités d’exploitation"]
["Coûts liés aux indemnités de départ, aux acquisitions et autres",41,null,22,null,19,null,288,null,251,null,37]
["Amortissements ",1287,null,1270,null,17,null,2559,null,2532,null,27]
["Coût des régimes d’avantages postérieurs à l’emploi ",19,null,31,null,-12,null,48,null,75,null,-27]
["Charges d’intérêts nettes",427,null,401,null,26,null,824,null,785,null,39]
["Perte de valeur d’actifs",8,null,60,null,-52,null,17,null,73,null,-56]
["Pertes sur placements",8,null,2,null,6,null,10,null,8,null,2]
["Pertes nettes sur participations mises en équivalence dans des entreprises associées et des coentreprises",0,null,93,null,-93,null,0,null,93,null,-93]
["Impôt sur le résultat",240,null,231,null,9,null,497,null,397,null,100]
["Cotisations aux régimes d’avantages postérieurs à l’emploi",-12,null,-10,null,-2,null,-30,null,-28,null,-2]
["Paiements en vertu de régimes d’autres avantages postérieurs à l’emploi",-15,null,-15,null,0,null,-29,null,-31,null,2]
["Coûts liés aux indemnités de départ et autres payés",-198,null,-98,null,-100,null,-279,null,-144,null,-135]
["Intérêts payés",-308,null,-387,null,79,null,-869,null,-835,null,-34]
["Impôt sur le résultat payé (après remboursements)",-50,null,-131,null,81,null,-124,null,-466,null,342]
["Coûts liés aux acquisitions et autres payés",-6,null,-11,null,5,null,-14,null,-26,null,12]
["Variation nette des actifs et des passifs d’exploitation",-138,null,75,null,-213,null,-707,null,-476,null,-231]
["Flux de trésorerie liés aux activités d’exploitation",1947,null,2137,null,-190,null,3518,null,3269,null,249]
["Dépenses d’investissement",-763,null,-978,null,215,null,-1492,null,-1980,null,488]
["Dividendes en trésorerie payés sur actions privilégiées",-38,null,-45,null,7,null,-77,null,-91,null,14]
["Dividendes en trésorerie payés par des filiales aux détenteurs de participations ne donnant pas le contrôle",0,null,-28,null,28,null,-13,null,-42,null,29]
["Coûts liés aux acquisitions et autres payés",6,null,11,null,-5,null,14,null,26,null,-12]
["Flux de trésorerie disponibles",1152,null,1097,null,55,null,1950,null,1182,null,768]
["Paiement de capital au titre des obligations locatives",-278,null,-270,null,-8,null,-582,null,-567,null,-15]
["Flux de trésorerie disponibles après les paiements au titre des obligations locatives",874,null,827,null,47,null,1368,null,615,null,753]
["Acquisitions d’entreprises",-24,null,-435,null,411,null,-23,null,-517,null,494]
["Cessions d’entreprises",36,null,0,null,36,null,38,null,0,null,38]
["Coûts liés aux acquisitions et autres payés",-6,null,-11,null,5,null,-14,null,-26,null,12]
["Augmentation (diminution) des placements à court terme",0,null,-50,null,50,null,400,null,250,null,150]
["Licences de spectre",0,null,-414,null,414,null,0,null,-518,null,518]
["Autres activités d’investissement",1,null,-11,null,12,null,-12,null,-21,null,9]
["Augmentation (diminution) des effets à payer",405,null,404,null,1,null,-726,null,1383,null,-2109]
["Émission de titres d’emprunt à long terme",318,null,1617,null,-1299,null,4755,null,3808,null,947]
["Remboursements sur la dette à long terme, déduction faite des paiements de capital au titre des obligations locatives",-1447,null,-255,null,-1192,null,-5399,null,-2071,null,-3328]
["Achat d’actions pour le règlement de paiements fondés sur des actions",-32,null,-40,null,8,null,-96,null,-144,null,48]
["Rachat d’actions privilégiées",-39,null,-38,null,-1,null,-76,null,-76,null,0]
["Dividendes en trésorerie payés sur actions ordinaires",-608,null,-910,null,302,null,-1210,null,-1793,null,583]
["Autres activités de financement",-20,null,4,null,-24,null,-67,null,-14,null,-53]
[null,-1416,null,-139,null,-1277,null,-2430,null,261,null,-2691]
["(Diminution) augmentation nette de la trésorerie",-542,null,609,null,-1151,null,-1065,null,851,null,-1916]
["Trésorerie au début de la période",1049,null,789,null,260,null,1572,null,547,null,1025]
["Trésorerie à la fin de la période",507,null,1398,null,-891,null,507,null,1398,null,-891]
["Augmentation nette des équivalents de trésorerie",0,null,79,null,-79,null,3,null,25,null,-22]
["Équivalents de trésorerie au début de la période",3,null,171,null,-168,null,0,null,225,null,-225]
["Équivalents de trésorerie à la fin de la période",3,null,250,null,-247,null,3,null,250,null,-247]

{"sheet":"BCE Inc. CF HIST p13","index":21,"n_rows":51,"n_cols":12,"rows_kept":51,"cut":false,"hidden":false,"merged":[[52,0,52,12]]}
[]
[null,null,null,null,null,null,null,null,null,null,null,"BCE"]
[null,null,null,null,null,null,null,null,null,null,null,"Données consolidées sur les flux de trésorerie – Tendance historique"]
[]
["(en millions de dollars canadiens, sauf indication contraire) (non audité)","Cumul\n2025",null,"T2 25","T1 25",null,"TOTAL\n2024",null,"T4 24","T3 24","T2 24","T1 24"]
[]
["Bénéfice net (perte nette) ",1327,null,644,683,null,375,null,505,-1191,604,457]
["Ajustements de rapprochement du bénéfice net (de la perte nette)\n     et des flux de trésorerie liés aux activités d’exploitation"]
["Coûts liés aux indemnités de départ, aux acquisitions et autres",288,null,41,247,null,454,null,154,49,22,229]
["Amortissements ",2559,null,1287,1272,null,5041,null,1250,1259,1270,1262]
["Coût des régimes d’avantages postérieurs à l’emploi",48,null,19,29,null,142,null,33,34,31,44]
["Charges d’intérêts nettes",824,null,427,397,null,1590,null,400,405,401,384]
["Perte de valeur d’actifs",17,null,8,9,null,2190,null,4,2113,60,13]
["Pertes (profits) sur placements",10,null,8,2,null,-57,null,1,-66,2,6]
["Pertes nettes sur participations mises en équivalence dans des entreprises \n     associées et des coentreprises",0,null,0,0,null,247,null,0,154,93,0]
["Impôt sur le résultat",497,null,240,257,null,577,null,175,5,231,166]
["Cotisations aux régimes d’avantages postérieurs à l’emploi",-30,null,-12,-18,null,-52,null,-12,-12,-10,-18]
["Paiements en vertu de régimes d’autres avantages postérieurs à l’emploi",-29,null,-15,-14,null,-61,null,-14,-16,-15,-16]
["Coûts liés aux indemnités de départ et autres payés",-279,null,-198,-81,null,-330,null,-57,-129,-98,-46]
["Intérêts payés",-869,null,-308,-561,null,-1759,null,-392,-532,-387,-448]
["Impôt sur le résultat payé (après remboursements)",-124,null,-50,-74,null,-783,null,-221,-96,-131,-335]
["Coûts liés aux acquisitions et autres payés",-14,null,-6,-8,null,-52,null,-25,-1,-11,-15]
["Variation nette des actifs et des passifs d’exploitation",-707,null,-138,-569,null,-534,null,76,-134,75,-551]
["Flux de trésorerie liés aux activités d’exploitation",3518,null,1947,1571,null,6988,null,1877,1842,2137,1132]
["Dépenses d’investissement",-1492,null,-763,-729,null,-3897,null,-963,-954,-978,-1002]
["Dividendes en trésorerie payés sur actions privilégiées",-77,null,-38,-39,null,-187,null,-53,-43,-45,-46]
["Dividendes en trésorerie payés par des filiales aux détenteurs de participations \n     ne donnant pas le contrôle",-13,null,0,-13,null,-68,null,-12,-14,-28,-14]
["Coûts liés aux acquisitions et autres payés",14,null,6,8,null,52,null,25,1,11,15]
["Flux de trésorerie disponibles",1950,null,1152,798,null,2888,null,874,832,1097,85]
["Paiement de capital au titre des obligations locatives",-582,null,-278,-304,null,-1142,null,-270,-305,-270,-297]
["Flux de trésorerie disponibles après les paiements au titre des obligations locatives",1368,null,874,494,null,1746,null,604,527,827,-212]
["Acquisitions d’entreprises",-23,null,-24,1,null,-624,null,-34,-73,-435,-82]
["Cessions d’entreprises",38,null,36,2,null,0,null,0,0,0,0]
["Coûts liés aux acquisitions et autres payés",-14,null,-6,-8,null,-52,null,-25,-1,-11,-15]
["Diminution (augmentation) des placements à court terme",400,null,0,400,null,600,null,350,0,-50,300]
["Licences de spectre",0,null,0,0,null,-531,null,0,-13,-414,-104]
["Autres activités d’investissement",-12,null,1,-13,null,14,null,43,-8,-11,-10]
["(Diminution) augmentation des effets à payer",-726,null,405,-1131,null,1945,null,-201,763,404,979]
["Émission de titres d’emprunt à long terme",4755,null,318,4437,null,3834,null,16,10,1617,2191]
["Remboursements sur la dette à long terme, exclusion faite des paiements de capital au titre d'obligations locatives",-5399,null,-1447,-3952,null,-2161,null,-52,-38,-255,-1816]
["Achat d’actions pour le règlement de paiements fondés sur des actions",-96,null,-32,-64,null,-235,null,-49,-42,-40,-104]
["Rachat d’actions privilégiées",-76,null,-39,-37,null,-92,null,-16,0,-38,-38]
["Dividendes en trésorerie payés sur actions ordinaires",-1210,null,-608,-602,null,-3613,null,-910,-910,-910,-883]
["Autres activités de financement",-67,null,-20,-47,null,-31,null,-14,-3,4,-18]
[null,-2430,null,-1416,-1014,null,-946,null,-892,-315,-139,400]
["(Diminution) augmentation nette de la trésorerie",-1065,null,-542,-523,null,1025,null,-288,462,609,242]
["Trésorerie au début de la période",1572,null,1049,1572,null,547,null,1860,1398,789,547]
["Trésorerie à la fin de la période",507,null,507,1049,null,1572,null,1572,1860,1398,789]
["Augmentation (diminution) nette des équivalents de trésorerie",3,null,0,3,null,-225,null,0,-250,79,-54]
["Équivalents de trésorerie au début de la période",0,null,3,0,null,225,null,0,250,171,225]
["Équivalents de trésorerie à la fin de la période",3,null,3,3,null,0,null,0,0,250,171]

{"sheet":"Accomp Notes p14","index":22,"n_rows":0,"n_cols":0,"rows_kept":0,"cut":false,"hidden":false,"merged":[]}

{"sheet":"Accomp Notes p15","index":23,"n_rows":0,"n_cols":0,"rows_kept":0,"cut":false,"hidden":false,"merged":[]}

{"sheet":"Accomp Notes p16","index":24,"n_rows":0,"n_cols":0,"rows_kept":0,"cut":false,"hidden":false,"merged":[]}

{"sheet":"Accomp Notes p17","index":25,"n_rows":0,"n_cols":0,"rows_kept":0,"cut":false,"hidden":false,"merged":[]}

{"sheet":"Accomp Notes p18","index":26,"n_rows":0,"n_cols":0,"rows_kept":0,"cut":false,"hidden":false,"merged":[]}